{"text_format":"1","workbook":"xlsx","n_sheets":15,"sheets":["Weight sheet","Cal","Trim","Lead Worksheet","Ballast","Pres cal","Tank _ PS notes","Maint","Motor Data","Material","sg_calib_constants","CMDFILE","PRM","As Built SN#s","Log"],"not_rendered":{"charts":0,"images":2,"macros":1,"external_links":2,"defined_names":202,"comments":5,"pivot_tables":0},"unopened":[],"bounds":{"document_bytes":16777216,"sheet_cells":100000,"rows_first":2000,"rows_last":500,"rows_between":2000,"halvings":0,"cell_chars":16384,"cell_head_chars":4096},"cells_cut":0,"cells_raw":0,"read":"whole","date_system":"1900"}

{"sheet":"Weight sheet","index":0,"n_rows":544,"n_cols":13,"rows_kept":544,"cut":false,"hidden":false,"merged":[[467,2,467,4],[2,4,2,5],[407,9,408,10],[367,2,367,4],[331,2,331,4],[466,2,466,4],[350,2,350,4]]}
[null,"Unit # SG:",512,null,"Total Unit Scale Weight /w Ballast",null,null,52652,"gm","Weighted on:","2016-08-16"]
[null,null,null,null,"Total Unit Scale Weight NO BALLAST",null,null,51555,"gm","Weighted on:","2016-08-05"]
[null,null,null,null,"Subtotal Unit Weight",null,null,{"$f":"SUM($H$6:$H$7,$H$10,$H$25,$H$44,$H$59,$H$71,$H$86,$H$230)","v":52581.100000000006},"gm","Delta:",{"$f":"$H$2-$H$3","v":-1026.1000000000058}]
[null,"Description","iRobot part #","UW Part #",null,"Qty","Ref Weight","Weight",null,"Delta:",{"$f":"$H$1-$H$3","v":70.899999999994179}]
[0,"Flying Seaglider",4197060,49801]
[1,"(8x) 10-32 x 3/8 FHMS, joint ring to aft fairing",4199128,55240,null,1,12.2,11.8,null,null,"Subtotal $H$3 = all purple lines:"]
[1,"(8x) 1/4-28 x 1/2 FHMS, Aft fairing to endcap or Ogive fairing screw",4199153,55294,null,1,27.5,28.1,null,null,"fwd fairing, ballast (if added), aft fairing, pupa"]
[]
[1,"Assy, Standard Forward Fairing",4199433,55494]
[null,null,null,null,"Subtotal Weight",null,null,{"$f":"IF($F$12=1,SUM((SUMPRODUCT($F$13:$F$22,$H$13:$H$22)),$H$168),0)","v":7744.3},"gm","diff",1]
[null,null,null,"Note:no plates","Scale Weight",null,7388,8018,"gm",{"$f":"$H$11-$H$10","v":273.69999999999982},"<-- includes Radiation Sensor if installed"]
[2,"Combined Forward Fairing  & Joint Ring","4199347 / 4199330",null,"Change Qty to 1 if installed",1,null,5996,null,null,"$H$11 measured on scale 6 Nov 14"]
[2,"Forward Fairing",4199347,49897,"Change Qty to 1 if installed",1,{"$f":"5515.4+12.1","v":5527.5},{"$f":"IF($F$12=1,($H$12-$H$14),0)","v":5308}]
[2,"Joint Ring, Fwd to Aft Fairing (bonded to fwd fairing before paint;  Long ring = 875g, short ring 688g )",4199330,49834,"Change Qty to 1 if installed",1,688,{"$f":"IF($F$12=1,688,0)","v":688}]
[2,"Nose weight (2 hole - bonded to fwd fairing after paint)",4199334,49844,"Change Qty to 1 if installed",1,1245,1248]
[2,"Detachable Fairing Nose","??","??",null,0,50]
[2,"Nose Weight (5 hole)","??","??",null,0,1276]
[2,"Nose Weight to Detachable Nose Screws",4199435,"??",null,0,39]
[2,"Nose weight plates",4199426,55448,null,{"$f":"Trim!$D$68","v":1},377,479.7,null,"latest","Plates = 245+124+ tuf gel"]
[2,"(2x) 1/4-20 x 2\" SHCS + 1/4 LW  brass, nose plate to nose base (4 - 5 plates)","/4199135","55186 / 55253",null,{"$f":"Trim!$D$69","v":0},28.3,null,null,null,"Ross = 401.3"]
[2,"(2x) 1/4-20 x 1.5\" SHCS + 1/4 LW  brass, nose plate to nose base (2 -3 plates)","4199112 / 4199135","55185 / 55253",null,{"$f":"Trim!$D$70","v":1},23.2,20.6]
[2,"(2x) 1/4-20 x .75\" SHCS + 1/4 LW  brass, nose plate to nose base (1 plate)","/4199135","55473 / 55253",null,{"$f":"Trim!$D$71","v":0},18]
[]
[1,"Assy., Ballast (STANDARD)"]
[null,null,null,null,"Subtotal Weight",null,null,{"$f":"SUM(ABS($F$27*$H$27),ABS($F$28*$H$28),ABS($F$29*$H$29),ABS($F$30*$H$30),ABS($F$31*$H$31),SUMPRODUCT($F$32:$F$41,$H$32:$H$41))","v":597.6},"gm"]
[null,null,null,null,"Scale Weight",null,null,{"$f":"SUM(ABS($F$27*$H$27),ABS($F$28*$H$28),ABS($F$29*$H$29),ABS($F$30*$H$30),SUMPRODUCT($F$32:$F$41,$H$32:$H$41))","v":597.6},"gm",null,"CARPET = ~1g","on 1x lead strip"]
[2,"Trim .600\" aft of pupa joint ring - bottom (5\" strip)",null,null,null,{"$f":"Trim!$D$76","v":1},0,{"$f":"Trim!$E$76","v":173.3},null,"BTM","CARPET=~15g ","on foam =>> 6 blocks: 3x strips, each 2.45g = 7.35g x2 for 12 foams"]
[2,"Trim .600\" aft of pupa joint ring - port side (5\" strip)",null,null,null,{"$f":"Trim!$D$78","v":0},0,{"$f":"Trim!$E$78","v":0},null,null,"CARPET= ~4g","on EPDM"]
[2,"Trim .600\" aft of pupa joint ring - starboard side (5\" strip)",null,null,null,{"$f":"Trim!$D$80","v":1},0,{"$f":"Trim!$E$80","v":172.9},null,"STB","3x eTAPE = 21","3x 2 wraps electrical tape, each 7 = 21 g"]
[2,"Trim .600\" aft of pupa joint ring - top (5\" strip)",null,null,null,{"$f":"Trim!$D$82","v":1},0,{"$f":"Trim!$E$82","v":-184.1},null,"TOP","2x eTAPE = 14","2 position: 2 times around SG"]
[2,"Trim 1.000\" fwd of bulkhead - bottom (5\" strip)",null,null,null,{"$f":"Trim!$D$87","v":0},0,{"$f":"Trim!$E$87","v":0},null,"FWD FWB","1x eTAPE = 7","1 position: 2 times around SG"]
[2,"EPDM base (5\"x6\") + (2x) 2\"x 6\" tape - bottom",null,"not in BOM","Change Qty to 1 if installed",0,50,0,null,"BTM","EPDM+carpet tape","=21.2+4.08"]
[2,"EPDM base (5\"x6\") + (2x) 2\"x 6\" tape - port",null,"not in BOM","Change Qty to 1 if installed",1,51.6,20.8]
[2,"EPDM base (5\"x6\") + (2x) 2\"x 6\" tape - starboard",null,"not in BOM","Change Qty to 1 if installed",1,50,19.8,null,"STB","EPDM+carpet tape","=22.8+4.08"]
[2,"EPDM base (5\"x6\") + (2x) 2\"x 6\" tape - top",null,"not in BOM","Change Qty to 1 if installed",0,50]
[2,"EPDM base (5\"x6\") + (2x) 2\"x 6\" tape - fwd of bulkhead - bottom",null,"not in BOM","Change Qty to 1 if installed",0,30,null,null,"FWD FWB","EPDM+carpet tape","=22.85+4.08"]
[2,"(2) Straps - cut to length (start at 34g, subtract trimmed)",null,"not in BOM","Change Qty to 1 if installed",0,30]
[2,"(2) Straps - cut to length (start at 17g, subtract trimmed) fwd of bulkhead",null,"not in BOM","Change Qty to 1 if installed",0,15,null,null,"FWD FWB","STRAPS","=14.72"]
[2,"Trim Lead tape (~1g per 5\" lead strip)",null,"not in BOM","Change Qty to 1 if installed",1,1,10.1,null,"CARPET","under foam+leads","=15.2+2.056"]
[2,"Trim Lead tape (~1g per 5\" lead strip) fwd of bulkhead",null,"not in BOM","Change Qty to 1 if installed",1,1,2,null,"FWD FWB","lead carpet + etape","=0.89+7+7"]
[2,"(2) black tape wraps over foam (1 1/2\" width)",null,"not in BOM","Change Qty to 1 if installed",1,43.5,14.6,null,"eTAPE","3x lead, then 3x foam","=7*3+(7*3)"]
[]
[1,"Assy., Ballast (BATTERY HULL FORWARD JOINT RING)"]
[null,null,null,null,"Subtotal Weight",null,null,{"$f":"SUM(ABS($F$46*$H$46),ABS($F$47*$H$47),ABS($F$48*$H$48),ABS($F$49*$H$49),SUMPRODUCT($F$50:$F$56,$H$50:$H$56))","v":0},"gm"]
[null,null,null,null,"Scale Weight",null,null,{"$f":"SUM(ABS($F$46*$H$46),ABS($F$47*$H$47),ABS($F$48*$H$48),ABS($F$49*$H$49),SUMPRODUCT($F$50:$F$56,$H$50:$H$56))","v":0},"gm"]
[2,"Trim .600\" aft of pupa joint ring - bottom (5\" strip)",null,null,null,{"$f":"Trim!$D$97","v":0},300,{"$f":"Trim!$E$97","v":0},null,"BTM"]
[2,"Trim .600\" aft of pupa joint ring - port side (5\" strip)",null,null,null,{"$f":"Trim!$D$99","v":0},0,{"$f":"Trim!$E$99","v":0}]
[2,"Trim .600\" aft of pupa joint ring - starboard side (5\" strip)",null,null,null,{"$f":"Trim!$D$101","v":0},0,{"$f":"Trim!$E$101","v":0},null,"STB"]
[2,"Trim .600\" aft of pupa joint ring - top (5\" strip)",null,null,null,{"$f":"Trim!$D$103","v":0},0,{"$f":"Trim!$E$103","v":0},null,"TOP"]
[2,"EPDM base (5\"x6\") + (2x) 2\"x 6\" tape - bottom",null,"not in BOM","Change Qty to 1 if installed",0,50,null,null,"BTM","EPDM+carpet tape","=23+4.43"]
[2,"EPDM base (5\"x6\") + (2x) 2\"x 6\" tape - port",null,"not in BOM","Change Qty to 1 if installed",0,51.6]
[2,"EPDM base (5\"x6\") + (2x) 2\"x 6\" tape - starboard",null,"not in BOM","Change Qty to 1 if installed",0,50,null,null,"STB","EPDM+carpet tape","=20.9+4.1"]
[2,"EPDM base (5\"x6\") + (2x) 2\"x 6\" tape - top",null,"not in BOM","Change Qty to 1 if installed",0,50]
[2,"(2) Straps - cut to length (start at 34g, subtract trimmed)",null,"not in BOM","Change Qty to 1 if installed",0,30]
[2,"Trim Lead tape (~1g per 5\" lead strip)",null,"not in BOM","Change Qty to 1 if installed",0,1,null,null,"CARPET","under foam+leads","=14.574+2.156"]
[2,"(2) black tape wraps over foam (1 1/2\" width)",null,"not in BOM","Change Qty to 1 if installed",0,43.5,null,null,"eTAPE","3x lead + 3x foam","=7*3+(7*3)","3x wraps for foam, 3x wraps for lead, no space for strap"]
[]
[1,"Assy, Ojive Forward Fairing",4199433,55494]
[null,null,null,null,"Subtotal Weight",null,null,{"$f":"IF($F$61=1,SUMPRODUCT($F$61:$F$68,$H$61:$H$68),0)","v":0},"gm","diff"]
[null,null,null,"Note:no plates","Scale Weight",null,7388,null,"gm",{"$f":"$H$60-$H$59","v":0},"<-- includes Radiation Sensor if installed"]
[2,"Ojive Forward Fairing","??","??","Change Qty to 1 if installed",0,5535]
[2,"Detacable Fairing Nose","??","??","Change Qty to 1 if installed",0,50]
[2,"Nose weight (5 hole)","??",49844,"Change Qty to 1 if installed",0,1276]
[2,"Nose weight to detachable nose screws",4199435,null,"Change Qty to 1 if installed",0,39]
[2,"Nose weight plates",4199426,55448,null,{"$f":"Trim!$D$118","v":0},124.5]
[2,"(2x) 1/4-20 x 2\" SHCS + 1/4 LW  brass, nose plate to nose base (4 - 5 plates)","/4199135","55186 / 55253",null,{"$f":"Trim!$D$119","v":0},28.3]
[2,"(2x) 1/4-20 x 1.5\" SHCS + 1/4 LW  brass, nose plate to nose base (2 -3 plates)","4199112 / 4199135","55185 / 55253",null,{"$f":"Trim!$D$120","v":0},23.2]
[2,"(2x) 1/4-20 x .75\" SHCS + 1/4 LW  brass, nose plate to nose base (1 plate)","/4199135","55473 / 55253",null,{"$f":"Trim!$D$121","v":0},15.7]
[]
[1,"Assy., Standard Aft Fairing",4199434,55497]
[null,null,null,null,"Subtotal Weight",null,null,{"$f":"IF($F$73=1,(SUM(SUMPRODUCT($F$73:$F$83*$H$73:$H$83),$H$101,$H$107,$H$113,$H$121,$H$127,$H$134,$H$141,$H$154,$H$162,$H$179,$H$186,$H$194,$H$202,$H$210,$H$218)),0)","v":5736.7},"gm","diff",2]
[null,null,null,null,"Scale Weight",null,5073,5741,"gm",{"$f":"$H$72-$H$71","v":4.3000000000001819},"<-- includes Antenna, CTD, Wetlab, Aanderaa, Seabird O2, Argos, PAR, etc., Sensors if installed "]
[2,"Aft Fairing",4199495,56972,"Change Qty to 1 if installed",1,2062,2005,null,null,"$H$71 measured on scale 6 Nov 14, EXCEPT wing screws"]
[2,"Wing, Starboard (1m)",4199438,56751,"Change Qty to 1 if installed",1,686,644.9]
[2,"Wing, Port  (1 m)",4199438,56751,"Change Qty to 1 if installed",1,697,645.4]
[2,"(16x) 6-32 x 3/8 FHMS (WING SCREWS)",4199270,56912,"Change Qty to 1 if installed",1,11.2,10.4]
[2,"Rudder",4199331,49839,"Change Qty to 1 if installed",1,120,122]
[2,"(2x) 1/4-20 x 2\" FHMS, rudder to rudder shoe",4199237,55487,"Change Qty to 1 if installed",1,20.3,20.5]
[2,"Top panel",4199496,57651,"Change Qty to 1 if installed",1,226,221]
[2,"Top panel (Bump Out)","?","?","Change Qty to 1 if installed",0,0]
[2,"Bottom panel",4199496,57651,"Change Qty to 1 if installed",1,230,200]
[2,"Bottom panel (Bump Out)","?","?","Change Qty to 1 if installed",0,0]
[2,"Panel screws - (18) FHMS 6-32 x .375 ",4205790,57671,"Change Qty to 1 if installed",1,17.600000000000001,17.399999999999999]
[]
[1,"Assy., Ojive Aft Fairing",4199434,55497]
[null,null,null,null,"Subtotal Weight",null,null,{"$f":"IF($F$89=1,(SUM(SUMPRODUCT($F$89:$F$98*$H$89:$H$98),$H$101,$H$107,$H$113,$H$121,$H$127,$H$134,$H$141,$H$154,$H$162,$H$179,$H$186,$H$194,$H$202,$H$210,$H$218)),0)","v":0},"gm","diff"]
[null,null,null,null,"Scale Weight",null,5073,null,"gm",{"$f":"$H$87-$H$86","v":0},"<-- includes Antenna, CTD, Wetlab, Aanderaa, Seabird O2, Argos, PAR, etc., Sensors if installed "]
[2,"Combined Aft Fairing  & Joint Ring",null,null,"Change Qty to 1 if installed",0]
[2,"Aft Fairing (Ogive)","??","??","Change Qty to 1 if installed",0,2062,{"$f":"IF($F$88=1,($H$88-$H$90),0)","v":0}]
[2,"Joint Ring, Aft to Forward Fairing (bonded to Aft fairing before paint)","??","??","Change Qty to 1 if installed",0,669,{"$f":"IF($F$88=1,$G$90,0)","v":0}]
[2,"Wing, Starboard (Ogive)","??","??","Change Qty to 1 if installed",0,686]
[2,"Wing, Port  (Ogive)","??","??","Change Qty to 1 if installed",0,697]
[2,"(16x) 6-32 x 3/8 FHMS (WING SCREWS)",4199270,56912,"Change Qty to 1 if installed",0,11.2]
[2,"Rudder (Ogive)","??","??","Change Qty to 1 if installed",0,120]
[2,"(2x) 1/4-20 x 2\" FHMS, rudder to rudder shoe",4199237,55487,"Change Qty to 1 if installed",0,20.3]
[2,"Top panel (Ogive)","??","??","Change Qty to 1 if installed",0,226]
[2,"Bottom panel (Ogive)","??","??","Change Qty to 1 if installed",0,230]
[2,"Panel screws - (18) FHMS 6-32 x .375 ",4205790,57671,"Change Qty to 1 if installed",0,17.600000000000001]
[]
[2,"Assy.,  Antenna",4199332,49841]
[null,null,null,null,"Subtotal Weight",null,null,{"$f":"SUMPRODUCT($F$103*$H$103)","v":549},"gm","diff"]
[null,null,null,null,"Scale Weight",null,476.5,549,"gm",{"$f":"$H$101-$H$102","v":0}]
[3,"Antenna Assembly GPSI (Shoe, mast, antenna, clamp, heat shrink, comm cable, dummy plug, dummy plug line, zip ties)","4199393 / 4199395 / 4199089 / 4199352 /4199234 / 4199105 / 4199262 /4199266 /4199394","52336 / 52341 / 52454 / 52231 / 55474 /52481 / 56875 /56884 / 52340",null,1,528.1,549]
[null,null,null,null,"Antenna SN:",null,null,"ES-140"]
[]
[2,"Assy., Aanderaa Optode Oxygen Sensor",4196239,55481]
[null,null,null,null,"Subtotal Weight",null,null,{"$f":"SUMPRODUCT($F$109*$H$109)","v":395},"gm","diff"]
[null,null,null,null,"Scale Weight",null,338.1,395,"gm",{"$f":"$H$108-$H$107","v":0}]
[3,"O2 Sensor Assy. (Aanderaa optode, mount base, SS hose clamp, (2x) 8-32 x 5/8 FHMS, (2x) 8-32 nylok)"," 4199035 / 4205811 / 4199129 / 4199163 / 4199130","52220 / 56905 / 55245 / 55321 / 55246","Change Qty to 1 if installed",1,433,395]
[null,null,null,null,"Aanderaa Optode SN:",0,null,"199"]
[null,null,null,null,null,0]
[2,"Assy., SBE 43f Oxygen Sensor (Not Pumped)",4192455,55482,null,0]
[null,null,null,null,"Subtotal Weight",null,null,{"$f":"SUM($F$115*$H$115,$F$117*$H$117)","v":366.40000000000003},"gm","diff"]
[null,null,null,null,"Scale Weight",null,null,366.4,"gm",{"$f":"$H$114-$H$113","v":0}]
[3,"O2 Sensor Assy. (O2 sensor, Plenum, (2x) 6-32 x 5/8 SHCS - plenum to sensor, O2 bracket, (2x) 8-32 x 5/8 FHMS - bracket to aft fairing, (2x) SS hose clamp)","4199047 / 4199435 / 4199129 /4199489 / 4199269","52356 / 55518/ 55245 / 56906 / 56911","Change Qty to 1 if installed",1,308.3,312.60000000000002]
[null,null,null,null,"SBE 43f SN:",null,null,"0221"]
[3,"O2 Sensor Cable Assembly",4199353,52236,"Change Qty to 1 if installed",1,59.1,53.8]
[3,"Plug assy, SBE 43f plenum",4199435,55518,null,0,"NA"]
[]
[2,"Assy., WET Labs Optical - FWD Hole - (Bump OUT)",4192457,55521]
[null,null,null,null,"Subtotal Weight",null,null,{"$f":"SUMPRODUCT($F$123*$H$123)","v":0},"gm","diff"]
[null,null,null,null,"Scale Weight",null,233.5,241,"gm",{"$f":"$H$122-$H$121","v":241}]
[3,"Wet Labs sensor Assy. (WL Triplet sensor, Bracket (BUMP), (2x) 6-32 x .625 SHCS - sensor clamp, 6-32 x 0.375 THCS)","4199039 / 4295315 / 4199120 / 4205790",null,"Change Qty to 1 if installed",0,233.5]
[null,null,null,null,"WET Labs SN:"]
[]
[2,"Assy., WET Labs Optical - aft hole",4192457,55521]
[null,null,null,null,"Subtotal Weight",null,null,{"$f":"SUMPRODUCT($F$129*$H$129)","v":238.2},"gm","diff"]
[null,null,null,null,"Scale Weight",null,233.5,269,"gm",{"$f":"$H$128-$H$127","v":30.800000000000011}]
[3,"Wet Labs sensor Assy. (WL Triplet sensor, (2x) Wet labs sensor clamp, (2x) 8-32 x 5/8 FHMS - sensor clamp to fairing)","4199039 / 4199388 / 4199129","52296 / 52312 / 55245","Change Qty to 1 if installed",1,233.5,238.2]
[null,null,null,null,"WET Labs SN:",null,null,"1390"]
[3,"Cover, WL sensor used in shipping",4199254,55520,null,0,"NA"]
[]
[2,"Assy., WET Labs Optical - Dual Hole Closest to PUPA",4192457,55521]
[null,null,null,null,"Subtotal Weight",null,null,{"$f":"SUMPRODUCT($F$136*$H$136)","v":249},"gm","diff"]
[null,null,null,null,"Scale Weight",null,233.5,249,"gm",{"$f":"$H$135-$H$134","v":0}]
[3,"Wet Labs sensor Assy. (WL Triplet sensor, Bracket Ext mount, 6-32 x 0.625 SHCS, 2x 6-32 x 0.375in Truss Head Phillips)","4199039 / 4295315 / 4199120 / 4205790","52296 / 52312 / 55245","Change Qty to 1 if installed",1,233.5,249]
[null,null,null,null,"WET Labs SN:",null,null,"946"]
[3,"Cover, WL sensor used in shipping",4199254,55520,null,0,"NA"]
[]
[2,"Assy., SBE CTD & Pumped 43f Oxygen Sensor",4295305]
[null,null,null,null,"Subtotal Weight",null,null,{"$f":"SUM(SUMPRODUCT($F$143:$F$145*$H$143:$H$145),($F$147*$H$147),SUMPRODUCT($F$149:$F$150*$H$149:$H$150))","v":0},"gm","diff"]
[null,null,null,null,"Scale Weight",null,null,null,"gm",{"$f":"$H$142-$H$141","v":0}]
[3,"GPCTD 90688.007, Bracket CTD Rear, Bracket CTD Forward, 6-32 x 0.625in SHCS, 8-32 x 0.25in Pan Head, 6-32 x 0.375in Flat Head","4272424 / 4289667 / 4289656 / 4199120 / 4233372 / 4199270","?","Change Qty to 1 if installed",0,917.7]
[3,"GPCTD PUMP PWR Cable, GPCTD PWR/Serial Cable","4293654 / 4274285","?","Change Qty to 1 if installed",0,102.5]
[3,"TUBING 2x 3/8in id x 1/2\" od, 2x 1/2\" id x 3/4\" od","4291710 / 4291709","?","Change Qty to 1 if installed",0,119]
[null,null,null,null,"SBE CTD SN:"]
[3,"GPCTD 90696 Pump, Pump Bracket, 6-32 x 0.375 Flat Head, Cable Ties","4272326 / 4295332 / 4199270 / 4199110","?","Change Qty to 1 if installed",0,381.4]
[null,null,null,null,"SBE CTD PUMP SN:"]
[3,"O2 Sensor",null,null,"Change Qty to 1 if installed",0,413.8]
[3,"O2 Sensor Cable Assembly",4293655,null,"Change Qty to 1 if installed",0,52.1]
[null,null,null,null,"SBE 43f (O2) SN:"]
[]
[2,"Assy., Argos Mount","?","?"]
[null,null,null,null,"Subtotal Weight",null,null,{"$f":"SUM(SUMPRODUCT($H$156*$F$156),SUMPRODUCT($F$158:$F$158*$H$158:$H$158))","v":52.5},"gm","diff"]
[null,null,null,null,"Scale Weight",null,null,52.5,"gm",{"$f":"$H$155-$H$154","v":0}]
[3,"Argos Tag","?","?","Change Qty to 1 if installed",1,62,52.5,null,"$H$156 added 7 Nov","PTT #"]
[null,null,null,null,"Argos SN:",null,null,"90993",null,null,"HEX #"]
[3,"Argos Mount Hardware. (?) - Clamp to Antenna, 4 screws, 2 brackets","2601, 4258110 ","?","Change Qty to 1 if installed",0,24.4,null,null,null,"Uplink ID"]
[]
[]
[2,"Assy., PAR, BSI - QSP2000","?","?"]
[null,null,null,null,"Subtotal Weight",0,null,{"$f":"SUM(SUMPRODUCT($H$164*$F$164),SUMPRODUCT($F$166:$F$167*$H$166:$H$167))","v":0},"gm","diff"]
[null,null,null,null,"Scale Weight",null,null,null,"gm",{"$f":"$H$163-$H$162","v":0}]
[3,"SENSOR, PAR BSI - QSP-200 SERIES + SHIELD, LIGHT- PAR BSI + (1x) SCREW, FLAT HEAD- PHILLIPS, #6-32 X .375, SS","?","?","Change Qty to 1 if installed",0,728.6]
[null,null,null,null,"PAR SN:"]
[3,"BRACKET, PAR QSP 2000, INTERNAL + SCREW, (2x) TRUSS HEAD - PHILLIPS, #6-32 X .375, SS + CLAMP, HOSE - WORM DRIVE 2.0IN TO 3.0IN, SS","?","?","Change Qty to 1 if installed",0,57.4]
[3,"ASSY, CABLE - PAR SENSOR INTERFACE","?","?","Change Qty to 1 if installed",0,63]
[]
[2,"Assy., Radiation Detector",4314372,"?"]
[null,null,null,null,"Subtotal Weight",null,null,{"$f":"SUM(SUMPRODUCT($H$172*$F$172),SUMPRODUCT($F$174:$F$175*$H$174:$H$175))","v":0},"gm","diff"]
[null,null,null,null,"Scale Weight",null,null,null,"gm",{"$f":"$H$171-$H$170","v":0}]
[3,"SENSOR, RADIATION DETECTOR",4314373,"?","Change Qty to 1 if installed",0,"?"]
[null,null,null,null,"Radiation SN:"]
[3,"BRACKET, SENSOR, RADIATION DETECTOR / BRACKET, FAIRING SUPPORT, RADIATION DETECTOR / (6x) SCREW, FLAT HEAD - PHILLIPS, #8-32X .625IN SS","4318407 / 4334120 / 4199129","?","Change Qty to 1 if installed",0,"?"]
[3,"FAIRING, SENSOR, RADIATION DETECTOR /  (6x) SCREW, BUTTON HEAD - ALLEN, #10-32 X 1.5IN SS","4318408 / 4254832","?","Change Qty to 1 if installed",0,"?"]
[3,"ASSY, CABLE - RADIATION DETECTOR / 1.5IN WIDE ELECTRICAL TAPE","4326393 / ??????",null,"Change Qty to 1 if installed",0,"?"]
[]
[2,"Assy, Nortek ADCP",4314562,"?"]
[null,null,null,null,"Subtotal Weight",null,null,{"$f":"SUM(SUMPRODUCT($H$181*$F$181),SUMPRODUCT($F$183:$F$183*$H$183:$H$183))","v":0},"gm","diff"]
[null,null,null,null,"Scale Weight",null,null,null,"gm",{"$f":"$H$180-$H$179","v":0}]
[3,"SENSOR, ACOUSTIC DOPPLER CURRENT PROFILER, NORTEK / BRACKET, SENSOR - ADCP / (4x) SCREW, SHCS, 10-32 X .500, SS / (3x) #6-32 X .375 TRUSS HEAD, SS","4314562 / 4328749 / 2539 / ????","?","Change Qty to 1 if installed",0,"?"]
[null,null,null,null,"ADCP SN:"]
[3,"SENSOR, CABLE","?????","?","Change Qty to 1 if installed",0,"?"]
[]
[2,"Assy, Imagenex ECHOSounder",4321091,"?"]
[null,null,null,null,"Subtotal Weight",null,null,{"$f":"SUM(SUMPRODUCT($F$188*$H$188),SUMPRODUCT($F$190:$F$191*$H$190:$H$191))","v":0},"gm","diff"]
[null,null,null,null,"Scale Weight",null,null,null,"gm",{"$f":"$H$187-$H$186","v":0}]
[3,"SENSOR, ECHOSOUNDER 853, IMAGENEX / BRACKET, SENSOR, BASE - ECHOSOUNDER / BRACKET, SENSOR, STANDOFF - ECHOSOUNDER / (2x) SCREW #8-32 X .500, SS /  (3x) SCREW TRUSS HEAD #6-32 X .375, SS / (4x) SCREW #8-32 X .25 TRUSS HEAD","4321091 / 4328900 / 4329102 ","?","Change Qty to 1 if installed",0,"?"]
[null,null,null,null,"ECHOSOUNDER SN:"]
[3,"SENSOR CABLE","-","?","Change Qty to 1 if installed",0,"?"]
[3,"New Sensor Cable","?","?","Change Qty to 1 if installed",0,"?"]
[]
[2,"Assy, RAFOS","??","?"]
[null,null,null,null,"Subtotal Weight",null,null,{"$f":"SUM(SUMPRODUCT($H$196*$F$196),SUMPRODUCT($F$198:$F$199*$H$198:$H$199))","v":0},"gm","diff"]
[null,null,null,null,"Scale Weight",null,null,null,"gm",{"$f":"$H$195-$H$194","v":0}]
[3,"Hydrophone for RAFOS system - added by UW-SFC","?","?","Change Qty to 1 if installed",0,114.8]
[null,null,null,null,"RAFOS SN:"]
[3,"RAFOS Mount Hardware. (?) ","?","?","Change Qty to 1 if installed",0,"?"]
[3,"RAFOS Cable","?","?","Change Qty to 1 if installed",0,"?"]
[]
[2,"Assy, New Sensor #1","??","?"]
[null,null,null,null,"Subtotal Weight",null,null,{"$f":"SUM(SUMPRODUCT($H$204*$F$204),SUMPRODUCT($F$206:$F$207*$H$206:$H$207))","v":0},"gm","diff"]
[null,null,null,null,"Scale Weight",null,null,null,"gm",{"$f":"$H$203-$H$202","v":0}]
[3,"New Sensor #1","?","?","Change Qty to 1 if installed",0,"?"]
[null,null,null,null,"New Sensor #1 SN:"]
[3,"New Sensor #1 Mount Hardware. (?) ","?","?","Change Qty to 1 if installed",0,"?"]
[3,"New Sensor #1 Cable","?","?","Change Qty to 1 if installed",0,"?"]
[]
[2,"Assy, New Sensor #2","??","?"]
[null,null,null,null,"Subtotal Weight",null,null,{"$f":"SUM(SUMPRODUCT($H$212*$F$212),SUMPRODUCT($F$214:$F$215*$H$214:$H$215))","v":0},"gm","diff"]
[null,null,null,null,"Scale Weight",null,null,null,"gm",{"$f":"$H$211-$H$210","v":0}]
[3,"New Sensor #2","?","?","Change Qty to 1 if installed",0,"?"]
[null,null,null,null,"New Sensor #2 SN:"]
[3,"New Sensor #2 Mount Hardware. (?) ","?","?","Change Qty to 1 if installed",0,"?"]
[3,"New Sensor #2 Cable","?","?","Change Qty to 1 if installed",0,"?"]
[]
[2,"Assy, AFT Foam Block Ballast","??","?"]
[null,null,null,null,"Subtotal Weight",null,null,{"$f":"SUMPRODUCT($F$220:$F$227*$H$220:$H$227)","v":0},"gm","diff"]
[null,null,null,null,"Scale Weight",null,null,null,"gm",{"$f":"$H$219-$H$218","v":0}]
[3,"Foam Block location \"under Ogive Top hatch cover\"","?","?","Change Qty to 1 if installed",0,1400]
[3,"Hardware for Foam Block location \"under Ogive Top hatch cover\"","?","?","Change Qty to 1 if installed",0,8.4]
[3,"Foam Block location \"Ogive Bottom Hatch cover\"","?","?","Change Qty to 1 if installed",0,574]
[3,"Hardware for Foam Block location \"Ogive Bottom Hatch cover\"","?","?","Change Qty to 1 if installed",0,8.4]
[3,"Foam Block location \"C\"","?","?","Change Qty to 1 if installed",0,"?"]
[3,"Hardware for Foam Block location \"C\"","?","?","Change Qty to 1 if installed",0,"?"]
[3,"Foam Block location \"D\"","?","?","Change Qty to 1 if installed",0,"?"]
[3,"Hardware for Foam Block location \"D\"","?","?","Change Qty to 1 if installed",0,"?"]
[]
[1,"Assy., Pupa",4199431,55486]
[null,null,null,null,"Subtotal Weight",null,null,{"$f":"SUM(SUMPRODUCT($F$233:$F$248,$H$233:$H$248),$H$255,$H$460,$H$479,$H$513,$H$526)","v":38462.600000000006},"gm","diff",3]
[null,null,null,null,"Scale Weight",null,38500,38454,"gm",{"$f":"$H$231-$H$230","v":-8.6000000000058208},"DN 8/5/2016"]
[null,"Complete pupae volume - sum this sheet",null,null,null,null,null,null,null,null,"Line Items used to calculate $H$230 are indicated in grey below:"]
[2,"Position B (Opt O2):  IE55 dummy plug",4199651,55309,"Change Qty to 1 if installed",0,7.4,null,null,null,null,"<--Show where sensors are installed here."]
[2,"Position C (WL-1):  IE55 dummy plug",4199651,55309,"Change Qty to 1 if installed",0,7.4]
[2,"Position D (SBE O2): IE55 dummy plug",4199651,55309,"Change Qty to 1 if installed",0,7.4]
[2,"Position E (WL-2):  IE55 dummy plug",4199651,55309,"Change Qty to 1 if installed",0,7.4]
[2,"Position F:  IE55 dummy plug",4199651,55309,"Change Qty to 1 if installed",1,7.4,7.3]
[2,"Position G: IE55 dummy plug",4199651,55309,"Change Qty to 1 if installed",0,7.4]
[2,"Position H: IE55 dummy plug",4199651,55309,"Change Qty to 1 if installed",0,7.4]
[2,"Posisiton I: IE55 dummy plug",4199651,55309,"Change Qty to 1 if installed",0,7.4]
[2,"Zinc Anode",4000014,55309,"Change Qty to 1 if installed",0,48.8]
[2,"O-Ring, E70-270, Endcap to Batt Hull",4199059,52411,null,1,8,8.6]
[2,"(7x) 6-32 x 1/2 SHCS w/ LW, endcap to battery hull WITH ZINCs FOR OLDER SYSTEM","4199111 / 4199122","55183 / 55217 / 55214 / 49884",null,1,13,13.9]
[2,"O-Ring, E70-270,  Bulkhead to batt. hull",4199059,52411,null,1,8,8.6]
[2,"(8x) 6-32 x 1/2 SHCS w/ LW, bulkhead to battery hull WITH ZINCs FOR OLDER SYSTEM","4199111 / 4199122","55183 / 55217 / 55214 / 49884",null,1,15.1,16.3]
[2,"(4x) 6-32 x 1/2 SHCS + #6 LW, rails to bulkhead","4199111 / 4199122","55183 / 55217",null,1,5.2,5.3]
[2,"O-Ring, E70-263, elec hull to bulkhead",4199058,52410,null,1,6.6,7.1]
[2,"(8x) 6-32 x 1/2 SHCS + #6 LW, elec hull to bulkhead","4199111 / 4199122","55183 / 55217",null,1,10.5,10.6]
[]
[null,null,"Start Relative Humidity",55.39,"Start internal Pressure",13.49]
[null,null,"End Relative Humidity",46.1,"End internal pressure",8.48]
[]
[2,"ASSY, AFT ENDCAP, ENHANCED - CT SAIL","4293521-00001","-"]
[2,"ASSY, AFT ENDCAP, ENHANCED - PLUG","4293521-00002","-"]
[null,"Endcap Subassembly Serial Number:",null,null,"Subtotal Weight",1,null,{"$f":"SUM($H$260,$H$269,$H$378,$H$402,SUMPRODUCT($F$430:$F$436,$H$430:$H$436),SUMPRODUCT($F$438:$F$444,$H$438:$H$444),SUMPRODUCT($F$446:$F$451,$H$446:$H$451),SUMPRODUCT($F$454:$F$456,$H$454:$H$456))","v":7290.1},"gm","diff"]
[null,null,null,null,"Scale Weight",null,7250,7291,"gm",{"$f":"$H$256-$H$255","v":0.8999999999996362},"Last trimsheet = 7304","this sheet: 7279.4"]
[]
[3,"OIL, HYDRAULIC SYNTHETIC:                              End Cap Without Oil",4199066,5585,null,"gm",null,5583,null,null,"old value: 5583"]
[null,"End Cap With Oil",null,6699,null,"gm",null,6700,null,null,"old value: 6700"]
[null,"Oil Added To System",null,{"$f":"$D$259-$D$258","v":1114},null,"gm",null,{"$f":"$H$259-$H$258","v":1117}]
[null,"Volume of Oil In System (=Oil_wt_2/Oil_density)",null,{"$f":"$D$260/0.8229","v":1353.7489366873253},null,"cc",null,{"$f":"$H$260/Material!$B$12","v":1357.3945801433954}]
[]
[null,null,null,null,"Max",null,"Min"]
[null,null,null,"VBD A",4060,null,299]
[null,null,null,"VBD B",4060,null,299]
[null,null,null,"HW Ave",{"$f":"($E$264+$E$265)/2","v":4060},null,{"$f":"($G$264+$G$265)/2","v":299}]
[null,null,null,"SW Ave",{"$f":"$E$266-100","v":3960},null,{"$f":"IF($G$266+100>500,$G$266+100,500)","v":500}]
[3,"ASSY, HYDRAULIC DRIVE",4293235,"-"]
[null,"Hydraulic Drive Serial Number:",null,null,"Subtotal Weight",null,null,{"$f":"SUM(SUMPRODUCT($F$272:$F$306,$H$272:$H$306),SUMPRODUCT($F$308:$F$331,$H$308:$H$331),SUMPRODUCT($F$333:$F$343,$H$333:$H$343))+$H$346+$H$364","v":4340.0999999999995},"gm","diff"]
[null,"Note: Adjusted scale weight includes the Union Elbow",null,null,"Adjusted Scale Weight",null,3962,{"$f":"$H$271+$H$284","v":3978.2}]
[null,null,null,null,"Scale Weight",null,3962,3962,"gm",{"$f":"$H$271-$H$269","v":-378.09999999999945},4348.5]
[4,"ENDCAP, HULL, AFT (6 - Port)",4199325,49815,"Change Qty to 1 if installed",1,null,2022]
[4,"(2x) PIN, SPRING, SLOTTED - 5/32\" DIA x .375L, 18-8 SS",4199132,55248,null,1,1.1000000000000001,1.1000000000000001]
[4,"FITTING, TUBE, MALE - RUN TEE 2 x 1/4\" TUBE, 1/8\" NPT M",4250762,"-",null,1,"??",8.5]
[4,"FITTING, TUBE, MALE - CONNECTOR, 1/4\" OD, 7/16-20 SAE/MS, SS",4199245,55506,null,1,27.8,27.6]
[4,"ASSY, CABLE - VBD VALVE - A1W19 (\"SKINNER VALVE\")",4199367,52254,null,1,605.70000000000005,607.70000000000005]
[4,"FITTING, TUBE, MALE - ADAPTER, 1/4\" TUBE, 1/8\" NPT M, SS",4199072,52430,null,1,10.5,10.5]
[4,"FITTING, TUBE, MALE - BRANCH TEE 2 x 1/4\" TUBE, 1/8\" NPT M",4250878,"-",null,1,8.5,19]
[]
[null,"For STANDARD BOOST PUMP"]
[4,"Tubing, 1/4 DIA x 8\" (Cut 8.25\")",4199064,52419,"Change Qty to 1 if installed",1,3.3,3.3]
[4,"Tubing, 1/4 Dia x 6.0\" (Cut 6.5\")",4199064,52419,"Change Qty to 1 if installed",1,2.6,2.6]
[4,"Check Valve, Kepner 204 A-1",4199084,52448,"Change Qty to 1 if installed",1,22.6,22.5]
[4,"Union Elbow, Male, 1/4 tube x 1/4 tube, alum",4199076,52435,"Change Qty to 1 if installed",1,16.100000000000001,16.2]
[4,"Tubing, 1/4 DIA x 9.625\" (Cut 9.75\")",4199064,52419,"Change Qty to 1 if installed",1,3.8,3.9]
[4,"Run Tee, Male,1/4 tube x 1/4 tube x 1/8 NPT, alum",4199075,52428,"Change Qty to 1 if installed",1,18.899999999999999,18.899999999999999]
[4,"Tubing, 1/4 Dia x 4.375\" (Cut 4.375\")",4199064,52419,"Change Qty to 1 if installed",1,1.9,1.9]
[]
[null,"For HIGH VOL BOOST PUMP"]
[4,"TUBING, 1/4\" OD 310 PSI (9.0in)",4263534,"-","Change Qty to 1 if installed",0,4.0999999999999996]
[4,"TUBING, 1/4\" OD 310 PSI (10.0in)",4263534,52419,"Change Qty to 1 if installed",0,4.5]
[4,"VALVE , CHECK, INLINE - SPRING POPPET 1/8\" NPT F. 1/8\" NPT M",4199084,52448,"Change Qty to 1 if installed",0,22.6]
[4,"TUBING, 1/4\" OD 310 PSI (8.0in)",4263534,"-","Change Qty to 1 if installed",0,3.6]
[4,"TUBING, 1/4\" OD 310 PSI (11.0in)",4263534,"-","Change Qty to 1 if installed",0,4.5]
[4,"TUBING, 1/4\" OD 310 PSI (4.375in)",4263535,"-","Change Qty to 1 if installed",0,2]
[4,"TUBING, 1/4\" OD 310 PSI (4.375in)",4263536,"-","Change Qty to 1 if installed",0,2]
[4,"FITTING, MALE - 1/4\" TUBE, 1/8\" NPT M",4275380,"-","Change Qty to 1 if installed",0,6.2]
[4,"TUBING, 1/4\" OD 310 PSI (1.25in)",4263536,"-","Change Qty to 1 if installed",0,0.6]
[4,"FITTING, TUBE, TEE - COUPLING 3 x 1/4\" TUBE",4251058,"-","Change Qty to 1 if installed",0,2.9]
[4,"FITTING, TUBE, MALE - 90DEG ELBOW, 1/4\" TUBE, 1/8\" NPT M",4251059,"-","Change Qty to 1 if installed",0,7.5]
[4,"FITTING, TUBE, MALE - 45DEG ELBOW, 1/4\" TUBE, 1/8\" NPT M",4251060,"-","Change Qty to 1 if installed",0,7.4]
[4,"VALVE, CHECK, INLINE - 1-2 PSI CRACK 2x 1/8\" NPT F, AL",4259549,"-","Change Qty to 1 if installed",0,25.4]
[]
[4,"WASHER, FLAT, STEEL, ZINC, SEAL",4199043,52350,null,1,0.9,0.9]
[4,"SCREW, PUMP OUTLET",4199400,52349,null,1,7.2,7.1]
[4,"PUMP, HYDRAULIC - 3 PISTON (LEDUC)",4199399,52348,null,1,315.5,316.5]
[null,null,null,null,"Leduc pump SN:",null,null,"59"]
[4,"ENDCAP, HYDRAULIC PUMP LEDUC",4259549,"-",null,1,110,110.8]
[4,"BEARING, BALL - 8mm SHAFT, SS, OPEN ",4199093,52459,null,1,3.2,3.1]
[4,"O-RING, BUNA-N, 70A -032",4199055,52407,null,1,0.5,0.4]
[4,"FITTING, TUBE, MALE - PIPE ADAPTER, 10-32 UNF, 1/8\" TUBE",4250882,"-",null,1,3,16.2]
[4,"TUBING, 1/8\" OD 500 PSI (8.875in)",4263530,"-",null,1,1.5,0.9]
[4,"SEAL, MAGNETIC  (Replace O-ring with 4214427 prior to weighing)",4199046,52353,null,1,13.9,13.9]
[4,"SCREW, SOCKET HEAD - ALLEN #6-32 x .500 L, 18-8 SS",4199111,55183,null,1,7,7.8]
[4,"PLUG - .250\" DIA, 3000PSI, Al / PIN - .250\" DIA PLUG, 3000PSI (LEE PLUG)","4199081 / 4199082","52445 / 52446",null,1,0.4,0.4]
[4,"VALVE, CHECK, BLADDER (altered Kepner 1106 A-1-1) / O-RING, BUNA-N, 90A -906 (N70 3-906)","4199338 / 4199056","49852 / 52408",null,1,47.9,48]
[4,"BLADDER, ACCUMULATOR",4199078,52441,"Bladder Date code:",1,113.5,113.2]
[4,"NUT, BLADDER",4199318,49802,null,1,109.4,109.4]
[4,"ASSY, CABLE, - INTERNAL COMMS - A1W17 (POSITION A {INTERNAL COMMS})",4199365,"-",null,1,11.5,10.9]
[4,"ASSY, CABLE, - RS232 SENSOR INTERFACE - A1W30 (POSITION B {OPT O2})",4199375,"-",null,1,11.5,11]
[4,"ASSY, CABLE, - RS232 SENSOR INTERFACE - A1W30 (POSITION C {WL-1})",4199375,"-",null,1,11.5,10.9]
[4,"ASSY, CABLE, - RS232 SENSOR INTERFACE - A1W30 (POSITION D {SBE-O2})",4199375,"-",null,1,11.5,10.9]
[4,"ASSY, CABLE, - RS232 SENSOR INTERFACE - A1W30 (POSITION E {WL-2})",4199375,"-",null,1,11.5,10.9]
[4,"ASSY, CABLE, - RS232 SENSOR INTERFACE - A1W30 (POSITION F)",4199375,"-",null,1,11.5,11]
[4,"ASSY, CABLE, - RS232 SENSOR INTERFACE - A1W30 (POSITION G)",4199375,"-",null,0,11.5]
[4,"ASSY, CABLE, - RS232 SENSOR INTERFACE - A1W30 (POSITION H)",4199375,"-",null,0,11.5]
[4,"ASSY, CABLE, - RS232 SENSOR INTERFACE - A1W30 (POSITION I)",4199375,"-",null,0,11.5]
[4,"Anode Adaptor + O-Ring","4068150 / 4199057","-",null,0,24.4]
[4,"ASSY, CABLE - IRIDIUM/GPS ANTENNA - A1W5 (LM-195 cable)",4199354,52241,null,1,64.599999999999994,64.599999999999994]
[4,"VALVE, PRESSURE RELIEF (DEEP SEA)",4199085,52449,null,1,11.5,11.6]
[4,"PLATE, PUMP DRIVE",4199320,49804,null,1,41.6,41.6]
[null,null,"Main Pump Motor SN: (start current, end current) -->"]
[4,"ASSY, CABLE - PUMP MOTOR, VBD HIGH PRESSURE - A11W18",4199366,52253,null,1,130.9,130.30000000000001]
[4,"(3X) SCREW, FLAT HEAD PHILLIPS, M2 x 0.4 X 6, 18-8 SS",8254,55203,null,1,0.3,0.4]
[4,"REDUCER, BORE - 3mm ID , AL",4199044,52351,null,1,0.7,0.7]
[4,"PULLEY, TIMING BELT, AL (LEDUC DRIVE MOTOR)",4199045,52352,null,1,5.7,5.7]
[4,"(6X) SCREW, FLAT HEAD - ALLEN, #4-40 x .375, 18-8 SS",17437,55229,null,1,3,3]
[4,"PULLEY, PUMP (LEDUC PUMP PULLEY)",4199321,49806,null,1,91.5,91.5]
[4,"BELT, TIMING 6mm WIDE, NEOPRENE",4199048,52357,null,1,3.4,3.5]
[4,"COVER, BELT, PUMP DRIVE",4199429,55476,null,1,18.5,18.399999999999999]
[4,"(4X) SCREW, SOCKET HEAD - ALLEN, #4-40 x .250, SS",2549,"-",null,1,2,2]
[4,"(2x) 6-32 x 1/2 SHCS + #6 LW, boost pump bracket to endcap","4199111 / 4199122","55183 / 55217",null,1,1.9,2.6]
[4,"Grounding Strap 27.5\"",null,null,null,0,2.7]
[]
[3,"Assy., Boost Pump (Standard)",4199411,52378]
[null,"Boost Pump Serial Number:",null,null,"Subtotal Weight",null,null,{"$f":"IFERROR(SUM(SUMPRODUCT($F$349:$F$350,$H$349:$H$350),SUMPRODUCT($F$352:$F$356,$H$352:$H$356),SUMPRODUCT($F$358:$F$360,$H$358:$H$360)),0)","v":384.3},"gm","diff"]
[null,"Note Union Elbow weight is added to the Drive system Scale weight",null,null,"Adjusted Scale Weight",null,384,{"$f":"$H$348-$H$361","v":384},"gm",{"$f":"$H$347-$H$346","v":-0.30000000000001137}]
[null,"Note: Adjusted scale weight removes the Union Elbow",null,null,"Scale Weight",null,{"$f":"$G$347+$G$361","v":400.1},384]
[4,"Pump Bracket",4199322,49808,"Change Qty to 1 if installed",1,21.8,21.8]
[4,"Motor, Chrge Pump w/ W34",4199384,52288,"Change Qty to 1 if installed",1,59.7,59.7]
[null,null,"Boost Pump Motor SN: (start current, end current) -->"]
[4,"(2x) M2 x 6 FHMS, motor to bracket",8254,55203,"Change Qty to 1 if installed",1,0.2,0.2]
[4,"Magnet Rotor Housing",4199092,52457,"Change Qty to 1 if installed",1,10.3,10.4]
[4,"(4x) 6-32 x 1/4 PHMS, bracket to housing",4146090,55209,"Change Qty to 1 if installed",1,3,3]
[4,"Rotary Magnet",4199090,52455,"Change Qty to 1 if installed",1,17.600000000000001,17.600000000000001]
[4,"Pumphead, Micropump + mounting plate + (3x) 4-40 x 3/8 FHMS  ","4199051 / 4199091 / 17437","52360 / 52456 / 55229","Change Qty to 1 if installed",1,224.3,224.3]
[null,null,null,null,"Micropump SN:"]
[4,"(4x) 4-40 x 3/16 SHCS + #4 LW, housing to flange","4199155 / 19928","55296 / 55233","Change Qty to 1 if installed",1,2,2]
[4,"(2x) Elbow, 1/8 npt x 1/4 tube, alum",4251059,52431,"Change Qty to 1 if installed",1,24.9,25]
[4,"Filter, Balston",4199068,52425,"Change Qty to 1 if installed",1,19.899999999999999,20.3]
[null,"Union Elbow, Male, 1/4 tube x 1/4 tube, alum",4199076,52435,"Change Qty to 1 if installed",0,16.100000000000001]
[]
[3,"ASSY, PUMP, BOOST (Enhanced)",4254582,"-"]
[null,"Boost Pump Serial Number:",null,null,"Subtotal Weight",null,null,{"$f":"IFERROR(SUM(SUMPRODUCT($F$366:$F$367,$H$366:$H$367),SUMPRODUCT($F$369:$F$373,$H$369:$H$373),SUMPRODUCT($F$375,$H$375)),0)","v":0},"gm"]
[null,null,null,null,"Scale Weight",null,711.7,null,"gm","diff"]
[4,"BRACKET, BOOST PUMP",4250419,"-","Change Qty to 1 if installed",0,35.200000000000003,null,null,{"$f":"$H$365-$H$364","v":0}]
[4,"ASSY, CABLE, MOTOR, BOOST PUMP HIGH VOL",4261167,"-","Change Qty to 1 if installed",0,233.4]
[null,null,"Boost Pump Motor SN: (start current, end current) -->"]
[4,"(4X) SCREW, FLAT HEAD - PHILLIPS, M3 X 0.5 X 8, 18-8 SS",4260277,"-","Change Qty to 1 if installed",0,1.8]
[4,"HOUSING, PUMP - RE-MAX 29",4249845,"-","Change Qty to 1 if installed",0,88.9]
[4,"(10X) SCREW, SOCKET HEAD, ALLEN, #4-40 X .250 + #4 LW","2549 / 19928","-","Change Qty to 1 if installed",0,4.8]
[4,"HUB ASSEMBLY, ROTARY MAGNET / SCREW, SET, CUP POINT- ALLEN 10-32 X .188, 18-8 SS","4259021 / 4258345","-","Change Qty to 1 if installed",0,77]
[4,"PUMP, GEAR, MAGNETIC DRIVE - 5.2 BAR",4258747,"-","Change Qty to 1 if installed",0,251]
[null,null,null,null,"Micropump SN:",null,null,"1523165"]
[4,"(2X) FITTING, TUBE, MALE - 90DEG ELBOW 1/4\" TUBE , 1/8\" NPT",4251059,"-","Change Qty to 1 if installed",0,14.8]
[]
[3,"ASSY, HYDRAULIC RESERVOIR (STANDARD)",4199397,"-"]
[null,"Standard Reservoir Serial Number:",null,null,"Subtotal Weight",null,null,{"$f":"SUMPRODUCT($F$380:$F$398,$H$380:$H$398)","v":1144.5000000000005},"gm"]
[null,"Scale Weight is just down to the yellow line",null,null,"Scale Weight",null,1148.4000000000001,1143,"gm","diff"]
[4,"Piston, Diaphragm",4199323,49811,"Change Qty to 1 if installed",1,137.4,137.80000000000001,null,{"$f":"$H$379-$H$378","v":-1.5000000000004547}]
[4,"Diaphragm, Internal (Bellofram)",4206402,56874,"Change Qty to 1 if installed",1,94.3,94.5]
[4,"Sikaflex Adhesive Compound",4199233,55459,"Change Qty to 1 if installed",1,12.3,7.7]
[4,"Cylinder Head, Diaphragm",4199474,56798,"Change Qty to 1 if installed",1,334.4,334.2]
[4,"Branch Tee, Male, 1/4 tube x 1/8 NPT x 1/4 tube, brass + Plastic plug (X59P4)","4199080 / 4205772","52443 / 52434","Change Qty to 1 if installed",1,23.3,23.2]
[null,"Elbow, 1/8 NPT M x 1/8 NPT M, brass",4199069,52426,"Change Qty to 1 if installed",1,26.9,26.7]
[4,"Kepner Chk Valve 404A-1-10",4199083,52447,"Change Qty to 1 if installed",1,26.8,25.9]
[4,"Elbow, 1/8 npt x 1/8 tube, alum",4199070,52427,"Change Qty to 1 if installed",1,25.8,8.6999999999999993]
[4,"Bleed screw, 10-32 x .125 PHMS with seal",4210092,55477,"Change Qty to 1 if installed",1,1.9,1.9]
[4,"Cylinder, Diaphragm",4199324,56943,"Change Qty to 1 if installed",1,422.5,422.6]
[4,"(8x) 5-40 x 3/8 SHCS +#5 LW, head to cylinder","4209126 / 4199125","? / 55225","Change Qty to 1 if installed",1,7.5,7.4]
[4,"Standoff (starboard)",4199418,55299,"Change Qty to 1 if installed",1,12.5,12.5]
[4,"Standoff (port)",4199418,55299,"Change Qty to 1 if installed",1,12.5,12.5]
[4,"(4x) 6-32 x 3/8 SHCS +#6 LW, standoff to cylinder","4199119 / 4199122","55183 / 55217","Change Qty to 1 if installed",1,4.5,4.5999999999999996]
[4,"(2x) Saddles, mounting, Aft PCB + (4x) 4-40 x 1/4 PHMS","4199410 / 4134111","52373 / 55257","Change Qty to 1 if installed",1,5,5]
[4,"(2x) Saddles, mounting, C PCB + (4x) 4-40 x 1/4 PHMS","4199345 / 4134111","49888 / 55257","Change Qty to 1 if installed",1,6.4,6.4]
[4,"(2x) Saddles, mounting, T PCB + (4x) 4-40 x 1/4 PHMS","4199345 / 4134111","49888 / 55257","Change Qty to 1 if installed",1,6.3,6.5]
[4,"(2x) Saddles, mounting, O2 PCB + (4x) 4-40 x 1/4 PHMS (only used with SBE 43f)","4199345 / 4134111","49888 / 55257","Change Qty to 1 if installed",1,6.4,6.4]
[4,"Ball Bearing joint / ring retaining spiral / stud mount / ball swivel ring","4205785 / 4205787 / 4205808 / 4205809",null,"Change Qty to 1 if installed",0,10]
[null,"Weigh Hydraulic res. Assy, then Oil fill & add sub-assy fasteners"]
[]
[3,"ASSY, HYDRAULIC RESERVOIR (ENHANCED)",4199397,"-"]
[null,"Enhanced Reservoir Serial Number:",null,null,"Subtotal Weight",null,null,{"$f":"SUMPRODUCT($F$404:$F$427,$H$404:$H$427)","v":0},"gm"]
[null,null,null,null,"Scale Weight",null,1148.4000000000001,null,"gm","diff"]
[4,"PISTON DIAPHRAGM",4199323,49811,"Change Qty to 1 if installed",0,140,null,null,{"$f":"$H$403-$H$402","v":0}]
[4,"DIAPHRAGM, ROLLING NITRILE (BELLOWFRAM)",4206402,56874,"Change Qty to 1 if installed",0,94.3]
[4,"ADHESIVE, STRUCTURAL - POLYURETHANE, SIKAFLEX 292",4199233,55459,"Change Qty to 1 if installed",0,12.3]
[4,"CYLINDER HEAD, SWIVEL MOUNT",4261356,"-","Change Qty to 1 if installed",0,334.4]
[4,"FITTING, TUBE, MALE - BRANCH TEE 2 X 1/4\" TUBE , 1/8\" NPT / FITTING, TUBE, PLUG - 1/4\" TUBE, NYL, RED","4250878 / 4251094","-","Change Qty to 1 if installed",0,23.3]
[4,"FITTING, PIPE - 90 DEG ELBOW 2 x 1/8\" NPT, M, BRASS",4199069,52426,"Change Qty to 1 if installed",0,26.9]
[4,"VALVE, CHECK, INLINE - 200 PSI CRACK, 2 x 1/8\" NPT, F, ALUM",4282752,"-","Change Qty to 1 if installed",0,24]
[4,"FITTING, TUBE, MALE - 90DEG ELBOW, 1/8\" TUBE , 1/8\" NPT, M ",4251095,"-","Change Qty to 1 if installed",0,7.4]
[4,"SCREW, PAN HEAD - PHILLIPS, #8-32 x .250, 18-8 SS, SEALING",4262362,"-","Change Qty to 1 if installed",0,1.2]
[4,"CYLINDER, DIAPHRAGM",4261328,"-","Change Qty to 1 if installed",0,422.1]
[4,"(8X) SCREW, SOCKET HEAD - ALLEN, #6-32 x .500,+ #6 LW","4199111 / 4199122","-","Change Qty to 1 if installed",0,6.6]
[4,"STANDOFF, RESERVOIR CYLINDER (STARBOARD)",4199418,55299,"Change Qty to 1 if installed",0,12.5]
[4,"STANDOFF, RESERVOIR CYLINDER (PORT)",4199418,55299,"Change Qty to 1 if installed",0,12.5]
[4,"(4X) SCREW, SOCKET HEAD - ALLEN, #6-32 x .500 + #6 LW","4199111 / 4199122","-","Change Qty to 1 if installed",0,4.0999999999999996]
[4,"(2x) MOUNT, SADDLE, TERMINAL PCBA ",4199410,52373,"Change Qty to 1 if installed",0,3.3]
[4,"(2X) MOUNT, SADDLE, PCBA (CONDUCTIVITY)",4199345,49888,"Change Qty to 1 if installed",0,6.4]
[4,"(2X) MOUNT, SADDLE, PCBA (TEMP)",4199345,49888,"Change Qty to 1 if installed",0,6.3]
[4,"(2X) MOUNT, SADDLE, PCBA (OXYGEN)",4199345,49888,"Change Qty to 1 if installed",0,6.4]
[4,"BRACKET, BALSTON FILTER",4275539,"-","Change Qty to 1 if installed",0,7.3]
[4,"FILTER, INLINE - 1/4\" TUBE 25um, 125 PSI, GLASS FIBER, PVDF",4199068,"-","Change Qty to 1 if installed",0,21]
[4,"CABLE TIE, 2.0IN BUNDLE - 8.75 LG, NYL, BLK, UV",4199110,"-","Change Qty to 1 if installed",0,0.5]
[4,"FITTING, TUBE, MALE - 90DEG ELBOW, 1/4\" TUBE, 1/8\" NPT M ",4251059,"-","Change Qty to 1 if installed",0,7.4]
[null,"FITTING, TUBE, STRAIGHT - COUPLING, 2 x 1/4\" TUBE",4251092,"-","Change Qty to 1 if installed",0,1.8]
[4,"STUD, MOUNT, SWIVEL - TTI / BEARING, BALL JOINT, SWIVEL / RING, RETAINER, BALL JOINT - TTI / RING, RETAINING, INTERNAL - SPIRAL","4205808 / 4205785 / 4205809 / 4205787","-","Change Qty to 1 if installed",0,10]
[null,"Weigh Hydraulic res. Assy, then Oil fill & add sub-assy fasteners"]
[null,"ASSY, LINEAR TRANSDUCER - VBD POSITION A",4264853]
[3,"ASSY, CABLE, LINEAR TRANSDUCER, VBD POSITION A - A1W20 / SPRING, COMPRESSION / KNOB, ROD END / CLAMP, LINEAR TRANSDUCER, POSTION VBD / SCREW, SOCKET HEAD, ALLEN #6-32 X .500, 18-8 SS","4199368 / 4198939 / 4199123","-",null,1,41,41.1]
[null,"ASSY, LINEAR TRANSDUCER - VBD POSITION B",4264855]
[3,"ASSY, CABLE, LINEAR TRANSDUCER, VBD POSITION B - A1W21 / SPRING, COMPRESSION / KNOB, ROD END / CLAMP, LINEAR TRANSDUCER, POSTION VBD / SCREW, SOCKET HEAD, ALLEN #6-32 X .500, 18-8 SS","4199369 / 4198939 / 4199123","-",null,1,38.6,38.700000000000003]
[2,"(2X) SCREW, SOCKET HEAD - ALLEN, #6-32 x .500, 18-8 SS",4199111,55183,null,1,2.6,2.1]
[3,"(4X) SCREW, SOCKET HEAD - ALLEN, #6-32 x .500 + #6 LW","4199111 / 4199122",55183,null,1,5.4,5.4]
[null,"aft endcap electronic parts - mount with CT sail"]
[3,"PCBA, AFT TERMINAL + (4X) #4-40  x .250 SHCS","4199419 / 2549",55302,null,1,25,25.1]
[null,null,null,null,"Aft Terminal SN:"]
[3,"PCBA, CONDUCTIVITY SENSOR (SEABIRD) + (4X) #4-40 x .250 SHCS","4199423 / 2549",55385,"Change Qty to 1 if installed",1,33.6,33.700000000000003]
[3,"ASSY, CABLE CONDUCTIVITY ELECTRONICS - A1W26",4199373,52261,"Change Qty to 1 if installed",1,3.2,3.3]
[3,"COVER, PCBA, COND. SENSOR /   (4x) SCREW, BH #2-56 x .25 , 18-8 SS","4199344 / 4199124","49887 / 55221","Change Qty to 1 if installed",1,20.399999999999999,20.3]
[3,"PCBA, TEMPERATURE SENSOR (SEABIRD) + (4X) #4-40 x .250 SHCS","4199425 / 2549",55388,"Change Qty to 1 if installed",1,22.5,22.3]
[3,"ASSY, CABLE TEMPERATURE ELECTRONICS - A1W25",4199372,52260,"Change Qty to 1 if installed",1,5.4,5.5]
[3,"COVER, PCBA TEMP. SENSOR / (4X) SCREW, BH #2-56 x .25 , 18-8 SS","4199409 / 4199124","52371 / 55221","Change Qty to 1 if installed",1,14.7,15.8]
[3,"PCBA, OXYGEN SENSOR + (4X) #4-40 x .250 SHCS","4199436 / 2549",55524,"Change Qty to 1 if installed",1,23.4,23.4]
[null,null,null,null,"SBE 43f PCB SN:"]
[3,"ASSY, CABLE - OXYGEN SENSOR PROCESSED SIGNAL - A1W33",4199377,52265,"Change Qty to 1 if installed",1,6,5.9]
[3,"ASSY, CABLE - TAIL PCBA SIGNAL INTERFACE - A1W13 (GREY)",4199361,52248,null,1,29.5,29.6]
[3,"ASSY, CABLE - TAIL PCBA POWER INTERFACE - A1W14 (RAINBOW)",4199362,52249,null,1,37.799999999999997,37.9]
[3,"Tape for Grey Ribbon Cable",null,null,null,1,0.5,0.8]
[3,"Tape for Rainbow Ribbon Cable",null,null,null,1,1.2,0.9]
[3,"ASSY, SAIL, CONDUCTIVITY - TEMPERATURE (SEABIRD)",4199407,52368,"Change Qty to 1 if installed",1,288.10000000000002,283]
[null,null,null,null,"CT sail SN:",null,null,"0073"]
[null,"ASSY, PLUG, CT  SAIL",4286191]
[null,"PLUG, CT SAIL / RING, BACKUP , O-RING - TEFLON -016 / O-RING, EPDM -016 / O-RING EPDM -012","4286190 / 4199255 / 4199067 / 4199057","-","Change Qty to 1 if installed",0,18.100000000000001]
[null,"NUT, CT SAIL",4199406,"-",null,1,9,9]
[3,"PIN, GUIDE, BATTERY PACK - TTI (\"STINGER\") / HARDSTOP, PITCH - TTI / SCREW, SOCKET HEAD - ALLEN, #8-32 x .375, SS","4205807 / 4205810 / 2601","-",null,1,75,84.7]
[]
[2,"Assy., Mass shifter",4199448,56768]
[null,"Mass Shifter Subassembly Serial Number:"]
[null,null,null,null,"Scale Weight",null,14079,14008,"gm"]
[null,"Moveable Weight"]
[null,"Battery Enclosure (moving assembly only not the support tube )","too many to record",56759,null,1,464,464]
[null,null,null,null,"Total Moveable Weight:",1,1835,{"$f":"$H$462+$H$465","v":1826.2}]
[null,"HV Battery",4199485,56831,null,1,9724,9623]
[null,"Brass weight, screws and Spacers (if required)",null,null,null,1,1362.2,1362.2]
[]
[null,null,"Pitch Motor SN: (start current, end current) -->"]
[null,null,"Roll Motor SN: (start current, end current) -->"]
[null,null,null,null,"Battery SN:",null,null,"1600007"]
[null,null,null,null,"Pressure sensor SN:",null,null,"253669"]
[]
[null,null,null,null,"Max",null,"Min"]
[null," ",null,"Pitch HW",4017,null,82]
[null,null,null,"Pitch SW Ave",{"$f":"$E$473-Cal!$C$10","v":3917},null,{"$f":"$G$473+Cal!$C$9","v":182}]
[null,null,null,"Roll HW",4082,null,105]
[null,null,null,"Roll SW Ave",{"$f":"$E$475-Cal!$C$25","v":3932},null,{"$f":"$G$475+Cal!$C$25","v":255}]
[]
[2,"Assy., Electronics",4199398,52347]
[null,"Main Electronics Subassembly Serial Number:",null,null,"Subtotal Weight",null,null,{"$f":"SUM(SUMPRODUCT($F$482:$F$484,$H$482:$H$484),SUMPRODUCT($F$489:$F$491,$H$489:$H$491),SUMPRODUCT($F$499:$F$500,$H$499:$H$500),SUMPRODUCT($F$506:$F$507,$H$506:$H$507),SUMPRODUCT($F$509:$F$510,$H$509:$H$510))","v":3962.7},"gm","diff"]
[null,null,null,null,"Scale Weight",null,3993,3974.1,"gm",{"$f":"$H$480-$H$479","v":11.400000000000091}]
[]
[3,"Electronics rail, port",4199465,56785,null,1,61.2,62]
[3,"Electronics rail, starboard",4199499,57672,null,1,62,61.4]
[3,"Seaglider Main board (Mother board, TT8, CF8, flash card)",4199386,52290,null,1,261.89999999999998,262.8]
[null,null,null,null,"Main board SN:",null,null,"92450012"]
[null,null,null,null,"TT8 SN:",null,null,"2422137"]
[null,null,null,null,"CF8V2 SN:",null,null,"2590"]
[null,null,null,null,"Flash Card SN:",null,null,"SSD-C25MI-3005"]
[3," Insulation Sheet-OEM/Main",4199408,52370,null,1,4.8,4.8]
[3,"(6x) 6-32 x 1/4 PHMS, main board to rails",4146090,55209,null,1,4.5,4.5]
[3,"Assy., OEM Navigation Board (transponder PCB, transformer/inductor, capacitors, GPS receiver, W6 GPS serial interface, GPS antenna cable,DC-DC converter, Cable Assembly W7, all soldered on wiring )",4199370,52257,null,1,583.70000000000005,591.4]
[null,null,null,null,"OEM board SN:"]
[null,null,null,null,"GPS SN:",null,null,"11H010522"]
[null,null,null,null,"DC-DC converter SN:",null,null,"11835A836"]
[null,null,null,null,"Acoustic main board SN:",null,null,"193"]
[null,null,null,null,"Acoustic sub board SN:",null,null,"193"]
[null,null,null,null,"RAFOS clock module"]
[null,null,null,null,"RAFOS reciever module "]
[3,"(6x) 6-32 x 1/4 PHMS, OEM board to rails",4146090,55209,null,1,4.5,4.5]
[3,"Assy.,  Iridium Modem and bracket (includes satellite receiver - iridium LBT, cable assy W3, all clamps for wires, RF switch, DC block, and mounting hardware)",4199389,52324,null,1,280,278.2]
[null,null,null,null,"Modem SN:",null,null,"707XL8"]
[null,null,null,null,"Modem IMEI:",null,null,"300224010849200"]
[null,"SIM Chip Phone #:",8089560582,null,"SIM Chip SN:",null,null,"8988169224000233297"]
[null,null,null,null,"RF Switch SN:"]
[null,null,null,null,"Modem PWR/Serial Cable SN:"]
[3,"(4x) 6-32 x 1/4 PHMS + #6 LW, modem cage to rails","4146090 / 4199122","55209 / 55217",null,1,3.4,3.5]
[3,"Battery Pack, LV w/ CA W1",4199484,56830,null,1,2640.8,2612.1]
[null,null,null,null,"Battery SN:",null,null,"1600012"]
[3,"Battery Pack Cage, LV + Two strips of tape ",4199335,49847,null,1,72.400000000000006,72.3]
[3,"(6x) 6-32 x 1/4 PHMS + #6 LW, batt. cage to rails","4146090 / 4199122","55209 / 55217",null,1,5.2,5.2]
[]
[2,"Assy., Battery Hull Sections",4199340,49878]
[null,"Battery Hull Subassembly Serial Number:",null,null,"Subtotal Weight",null,null,{"$f":"SUMPRODUCT($F$515:$F$523,$H$515:$H$523)","v":7978.8},"gm","diff"]
[null,null,null,null,"Scale Weight",null,7972,7977,"gm",{"$f":"$H$514-$H$513","v":-1.8000000000001819}]
[3,"Hull, Fwd Battery",4199326,49817,null,1,3602,3612]
[3,"Hull, Aft Battery",4199326,49817,null,1,3604,3608]
[3,"Joint Ring , battery hulls",4199327,49818,null,1,686,681]
[3,"(8x) 6-32 x 3/4 SHCS + #6 LW, joint ring to fwd/aft batt. Hull","4199121 / 4199122","55215 / 55217",null,1,13.2,13.2]
[3,"Grounding Strap 17.5\"",null,null,null,0,2.2999999999999998]
[3,"(2x) O-Ring, E70-271",4199060,52412,null,1,16.7,16.5]
[3,"(12x) Clips, Rib",4199341,49883,null,1,{"$f":"25.7/14 *12","v":22.028571428571428},25.8]
[3,"(12x) Clips, Wiring",4199412,52405,null,1,18.600000000000001,18.5]
[3,"Oil Absorption pad, 1.9\" x 10.125\" + (2x) rib clips","4134111 / 4199341","55527 / 49883",null,1,{"$f":"4+3.7","v":7.7},3.8]
[]
[2,"Assy., Forward Hull Sections",4199339,49877]
[null,"Forward Hull Subassembly Serial Number:",null,null,"Subtotal Weight",null,null,{"$f":"SUM(SUMPRODUCT($F$528:$F$529,$H$528:$H$529),SUMPRODUCT($F$531:$F$537,$H$531:$H$537),SUMPRODUCT($F$540:$F$541,$H$540:$H$541))","v":5145.2999999999993},"gm","diff"]
[null,null,null,null,"Scale Weight",null,5153,5146,"gm",{"$f":"$H$527-$H$526","v":0.7000000000007276}]
[3,"Endcap, Forward",4199329,49830,null,1,1899.4,1887]
[3,"Acoustic transducer (ITC-3013), w/ cable W36","4199379 / 4199036","52267 / 52223",null,1,1442.2,1436]
[null,null,null,null,"Transducer SN:",null,null,5190]
[3,"O-Ring, E70-238, transducer to Endcap",4199062,52413,null,1,3.2,3.2]
[3,"(6x) Alum 1/4-20 x 3/4 SHCS + 1/4 LW, xducer to end cap","4199127 / 4199134","55236 / 55252",null,1,15.2,15.1]
[3,"Hull, Electronics",4199328,49829,null,1,1689,1690]
[3,"O-Ring, E70-263, elec hull to fwd endcap",4199058,52410,null,1,6.6,6.6]
[3,"(8x) 6-32 x 1/2 SHCS + #6 LW, elec hull to fwd endcap","4199111 / 4199122","55183 / 55217",null,1,10.4,10.4]
[3,"Grounding Strap 24\"",null,null,null,1,2.9,24.7]
[3,"Compass bracket,Compass w/compass carrier PCB (w/ tywrap),(4x) 4-40 x 3/8 SHCS + #4 x 1/8L stand off + #4LW","4199336,4199420 / 4205793,4199126 / 4199146 /19928","49848, 55305 / 57690,55228 / 55282",null,1,74.3,48.9]
[null,null,null,null,"Compass PCB SN:",null,null,91880010]
[null,null,null,null,"Compass Module SN:",null,null,"K887"]
[3,"(2x) 4-40 X 3/8 SHCS + #4 LW, comp mt to fwd endcap","4199126 / 19928","55228 / 55233",null,1,1.4,1.3]
[3,"Cable Assembly W9  (compass cable)",4199357,52244,null,1,22.1,22.1]
[]
[]
[null,null,null,null,null,null,null,null,null,{"$f":"(J11+J60+J72+J231+J256+J271+J347+J380+J480+J514+J527)","v":-99.300000000005468}]

{"sheet":"Cal","index":1,"n_rows":313,"n_cols":10,"rows_kept":313,"cut":false,"hidden":false,"merged":[[135,0,135,1],[135,2,135,3],[18,9,18,10],[127,0,127,3]]}
["Calibration Sheet for Seaglider",null,"Serial No.",{"$f":"'Weight sheet'!$C$1","v":512}]
["Date:",{"$f":"NOW()","v":"2016-08-29T14:22:50.640"},null,"(From Weight sheets)"]
["Time:",{"$f":"NOW()","v":"2016-08-29T14:22:50.640"}]
["Software Revision","66.11/1138","Glider PW:"]
[]
["Pitch Mass",null,"Last updated","2016-08-16"]
[null,null,"Comments"]
[]
[null,"Headroom, fwd",100,"AD counts","*Changed @ Kongsberg from 50 (on last trimsheet)"]
[null,"Headroom, aft",100,"AD counts",null,"Old values, last trimsheet"]
[null,"Hardware Limit (counts)","Software Limit (counts)","cm travel*",null,"Software","cm travel"]
["Minimum (full forward)",{"$f":"'Weight sheet'!$G$473","v":82},{"$f":"$B$12+$C$9","v":182},{"$f":"($C$12-$C$15)*$B$17","v":-8.083223443223444},null,54,-6.84]
["Maximum (full aft)",{"$f":"'Weight sheet'!$E$473","v":4017},{"$f":"$B$13-$C$10","v":3917},{"$f":"($C$13-$C$15)*$B$17","v":3.5915018315018314},null,3823,4.9400000000000004]
["Stroke Length",null,null,{"$f":"$D$13-$D$12","v":11.674725274725276}]
[" Pitch Center","(as defined by $C_PITCH)",2768,{"$f":"($C$15-$C$15)*$B$18","v":0},null,2244]
[null,null,"cm full stroke:",12.8]
["Conversion constant",{"$f":"12.8/4095","v":3.1257631257631258E-3},"cm per AD","($PITCH_CNV)"]
["(conversion inverse)",{"$f":"1/$B$17","v":319.921875},"AD per cm"]
["*equation","cm = (AD –center)* conversion factor (cm/AD)",null,null,null,null,null,null,null,"Tank Values"]
[null,"(-) cm is fwd of center, (+) cm is aft of center",null,null,null,null,null,null,null,"C_VBD"]
[null,null,null,null,null,null,null,null,null,"C_Pitch"]
["Roll Mass",null,"Last updated","2016-08-16",null,null,null,null,null,"C_Roll"]
[null,null,"Comments",null,null,null,null,null,null,"Nose Wt"]
[null,null,null,null,null,null,null,null,null,"Mass"]
[null,"Headroom",150,"AD counts",null,null,null,null,null,"Density"]
[null,"Hardware Limit (counts)","Software Limit (counts)","degrees roll*",null,null,null,null,null,"Trim Lead - bottom"]
["Full roll to port",{"$f":"'Weight sheet'!$G$475","v":105},{"$f":"$B$27+$C$25","v":255},{"$f":"($C$27-$C$29)*$B$32","v":-50.74465},null,null,null,null,null,"EPDM base - bottom"]
["Full roll to starboard",{"$f":"'Weight sheet'!$E$475","v":4082},{"$f":"$B$28-$C$25","v":3932},{"$f":"($C$28-$C$29)*$B$32","v":53.204140000000002},null,null,null,null,null,"Trim - port side"]
["Dive Roll Center",{"$f":"$C$27+($C$28-$C$27)/2","v":2093.5},2050,"($C_ROLL_DIVE)","*2041.5 was empty cell",null,null,null,null,"EPDM base - port"]
["Climb Roll Center",{"$f":"$C$27+($C$28-$C$27)/2","v":2093.5},2030,"($C_ROLL_CLIMB)",null,null,null,null,null,"Trim Lead - starboard side"]
[null,null,null,null,null,null,null,null,null,"EPDM base - starboard"]
["Conversion constant",2.827E-2,"degree per AD","($ROLL_CONV)",null,null,null,null,null,"Trim Lead- top"]
["(conversion inverse)",35.369999999999997,"AD per degree",null,null,null,null,null,null,"EPDM base - top"]
["*Equation:","deg=(AD-center) * conversion factor",null,null,null,null,null,null,null,"Trim Lead tape"]
[null,null,null,null,null,null,null,null,null,"(2) Straps"]
["Variable Buoyancy Drive (VBD)",null,"Last updated","2016-08-16",null,null,null,null,null,"(2) black tape wraps over foam"]
[null,null,"Comments",null,null,null,null,null,null,"Trim Lead fwd of bulkhead - bottom"]
["LeDuc Pump  Serial #",{"$f":"'Weight sheet'!$H$307","v":"59"},"(short shaft  Serial #)",null,null,null,null,null,null,"Trim Lead tape"]
["Boost Pump  Serial #",{"$f":"'Weight sheet'!$H$374","v":"1523165"},null,null,null,null,null,null,null,"EPDM base fwd of bulkhead - bottom"]
[null,"Headroom",100,"AD counts",null,"Old values, last trimsheet",null,null,null,"Strap - fwd of bulkhead"]
[null,"Hardware Limit (counts)","Software Limit (counts)","cm3 (cc) oil*",null,"Software","cm3"]
["$VBD_Min (Ext Bladder full)",{"$f":"'Weight sheet'!$G$266","v":299},{"$f":"IF($B$42+$C$40>500,$B$42+$C$40,500)","v":500},{"$f":"($C$42-$C$45)*$B$47","v":588.45937009855652},null,399,532]
["$VBD_Max (Ext Bladder empty)",{"$f":"'Weight sheet'!$E$266","v":4060},{"$f":"$B$43-$C$40","v":3960},{"$f":"($C$43-$C$45)*$B$47","v":-260.26478990144346},null,3960,-342]
["Total movable oil volume",{"$f":"$B$43-$B$42","v":3761},{"$f":"$C$43-$C$42","v":3460},{"$f":"$D$42-$D$43","v":848.72415999999998},null,3561,873]
["Neutral Trim (from Ballast sheet)","($C_VBD for neutral)",{"$f":"Trim!$E$20","v":2898.9766245619844},"(nominally 0 at spec rho)",null,2566]
[]
["Conversion constant",-0.24529599999999999,"cc per AD","$VBD_CNV"]
["(conversion inverse)",{"$f":"1/$B$47","v":-4.0767073250277219},"AD per cc"]
["*equation:","cc oil=(AD@neutral trim)* conv. factor (cc/counts)"]
[null,"(1 cc oil = 1.025 g buoyancy)"]
[]
["Pressure Sensor",null,"Last updated",{"$f":"'Pres cal'!$D$1","v":"2014-11-03"}]
["(all values fed from press-cal worksheet including date)",null,"Comments"]
[null,"Values from Pres Cal sheet"]
["Manufacturer",{"$f":"'Pres cal'!$B$3","v":"Paine"}]
["Model #",{"$f":"'Pres cal'!$B$4","v":"211-75-710-05"}]
["Serial #",{"$f":"'Pres cal'!$B$5","v":"253669"}]
["Calibration date",{"$f":"'Pres cal'!$B$6","v":"2009-08-24"}]
["A/D Gain",{"$f":"'Pres cal'!$B$7","v":128},null,"PSI = Slope *AD_Count + Y_Intercept"]
["Atmos @ cal.",{"$f":"'Pres cal'!$B$8","v":14.7}]
["Temp @ cal.",{"$f":"'Pres cal'!$B$9","v":0},"Psig/AD count",null,null,"Pres Cal last trimsheet incorrect (typo):"]
["Calibrated Slope",{"$f":"'Pres cal'!$B$64","v":1.1652685992258822E-4},"(either PresCal-B64)",null,null,1.1360508456156899E-4]
["Cal. Y-Intercept",{"$f":"'Pres cal'!$B$65","v":-67.641609888241376},"(Changed each time sensor set for “sea level”)",null,null,-23.045728892795932]
["Depth Offset",{"$f":"'Pres cal'!$B$66","v":-46.334502773445344},"Meters",null,null,-15.786324291565215]
[null,"Conversion Factor","0.685 psig/meter"]
["Internal Pressure",null,"Last updated","2016-08-16"]
["Initial psi:",{"$f":"'Weight sheet'!$F$250","v":13.49},"End psi:",{"$f":"'Weight sheet'!$F$251","v":8.48}]
["Initial RH:",{"$f":"'Weight sheet'!$D$250","v":55.39},"End RH:",{"$f":"'Weight sheet'!$D$251","v":46.1}]
[]
["Compass",null,"Last updated","2016-03-10"]
[null,null,"Comments"]
["Manufacturer","Sparton"]
["Model #","SP3004D"]
["Serial #",{"$f":"'Weight sheet'!$H$539","v":"K887"}]
["Compass SW version #"]
["Compass carrier PCB",{"$f":"'Weight sheet'!$H$538","v":91880010}]
["Snug Calibration Date","03/101/2016"]
["TCM2MAT file creation date","2016-03-10"]
[]
["Main Board",null,"Last updated","2013-03-14"]
[null,null,"Comments"]
["Model #",52290,"(52290=normal glider)"]
["Mainboard Revision","B.4"]
["Mainboard Serial #",{"$f":"'Weight sheet'!$H$485","v":"92450012"}]
["Computer Type","TT8","Onset Computers"]
["Computer Serial #",{"$f":"'Weight sheet'!$H$486","v":"2422137"}]
["Disk system","CF8V2","Persistor Corp."]
["Serial #",{"$f":"'Weight sheet'!$H$487","v":"2590"}]
["Compact Flash Card Manu.","Silicon Systems  "]
["CF card size","256 MB"]
["CF card  serial/ID #",{"$f":"'Weight sheet'!$H$488","v":"SSD-C25MI-3005"}]
[]
["Watchdog (PIC) setting (min)","10 min","(10min = dips 2&4 on)"]
[]
["OEM Board & Sub-systems",null,"Last updated","2013-03-14"]
[null,null,"Comments"]
["GPS Manufacturer","Garmin"]
["GPS Model #","15H-W"]
["GPS Serial #",{"$f":"'Weight sheet'!$H$493","v":"11H010522"}]
[]
["GPSI Antenna  Serial #",{"$f":"'Weight sheet'!H104","v":"ES-140"},"(fab by Ocean Eng Services)"]
["DC-DC converter  Serial #",{"$f":"'Weight sheet'!$H$494","v":"11835A836"}]
[]
["Transducer Manu.","ITC"]
["Transducer Model",3013]
["Transducer  Serial #",{"$f":"'Weight sheet'!$H$530","v":5190}]
[]
["Acoustic Transponder",null,"Last updated","2013-03-14"]
[null,null,"Comments"]
["Manufacturer","AAE"]
["Model",955]
["Main-board  Serial #",{"$f":"'Weight sheet'!$H$495","v":"193"}]
["Sub-board  Serial #",{"$f":"'Weight sheet'!$H$496","v":"193"}]
["AAE software ver #","Ver "]
[]
["Interrogate Frequency",12,"KHz"]
["Reply Frequency",10.5,"KHz"]
["DIP switch settings","9 / B","(sw-1/sw-2)"]
[]
["Iridium Modem",null,"Last updated","2013-03-14"]
[null,null,null,"Comments"]
["Model","A3LA-XG"]
["IMEI #",{"$f":"'Weight sheet'!$H$502","v":"300224010849200"}]
["Modem  Serial #:",{"$f":"'Weight sheet'!$H$501","v":"707XL8"}]
["SIM Card Owner","UH","primary phone #","secondary #"]
["SIM Card  Serial #",{"$f":"'Weight sheet'!$H$503","v":"8988169224000233297"},{"$f":"'Weight sheet'!$C$503","v":8089560582},8089560583]
["Base Modem Type:","9522B"]
["External Sensors Options"]
[]
["SBE C and T Sensors",null,"Last updated","2016-03-10"]
[null,null,null,"Comments"]
["Sail  Serial #",73]
["Temp PCB  Serial #",{"$f":"$B$132","v":73}]
["Cond PCB  Serial #",{"$f":"$B$132","v":73}]
["SBE Calibration date:","2015-12-30"]
["Conductivity Calibration Coefficients",null,"Temperature Calibration Coefficients"]
["g=",-9.7695149600000004,"g=",4.2942334299999997E-3]
["h=",1.0891893399999999,"h=",6.2847037000000004E-4]
["i=",7.8893855400000005E-4,"i=",2.3239886599999999E-5]
["j=",5.7872018800000003E-6,"j=",2.4096663899999998E-6]
["Cpcor (nom) =",-9.5700000000000003E-8,"f0 =",1000]
["Ctcor (nom) =",3.2499999999999998E-6]
["INST FREQ Min (kHz)=",2.9916100000000001,"INST FREQ Min (Hz)=",2904.4140000000002,null,"*Take the frequency values from the calibration sheets. "]
["INST FREQ  Max (kHz)=",8.0043699999999998,"INST FREQ  Max (Hz)=",5565.3559999999998]
[]
[]
["Optical Sensor(s)",null,"Last updated","2016-03-10"]
["Forward or Bump Out",null,"cal date","2015-11-24",null,null,null,null,"   "]
["Manufacturer","Wetlab"]
["Model",{"$f":"IF($B$160=\"CDOM\",\"BBFL2\",IF($B$160 & $B$167=\"NoneNone\",\"None\",\"BB2FL\"))","v":"BBFL2"}]
["Serial #",{"$f":"IF('Weight sheet'!$H$124=0,'Weight sheet'!$H$137,'Weight sheet'!$H$124)","v":"946"}]
[]
["Chlorophyll cal Constants","Chlorophyll"]
[{"$f":"\"WETLabsCalData.\"&$B$153&\".darkCounts\"","v":"WETLabsCalData.Chlorophyll.darkCounts"},48,"counts"]
[{"$f":"\"WETLabsCalData.\"&$B$153&\".scaleFactor\"","v":"WETLabsCalData.Chlorophyll.scaleFactor"},1.18E-2,"ug/l/count"]
[{"$f":"\"WETLabsCalData.\"&$B$153&\".maxOutput\"","v":"WETLabsCalData.Chlorophyll.maxOutput"},4130,"counts"]
[{"$f":"\"WETLabsCalData.\"&$B$153&\".resolution\"","v":"WETLabsCalData.Chlorophyll.resolution"},1,"counts"]
[{"$f":"\"WETLabsCalData.\"&$B$153&\".calTemperature\"","v":"WETLabsCalData.Chlorophyll.calTemperature"},20,"C"]
[]
["CDOM or Scattering  Sensor","CDOM",{"$f":"IF($B$160=\"470\",\"(BLUE)\",IF($B$160=\"532\",\"(GREEN)\",IF($B$160=\"650\",\"(RED)\",IF($B$160=\"880\",\"(PINK)\",\"\"))))","v":""}]
[{"$f":"IF($B$160=\"CDOM\",\"WETLabsCalData.\"&$B$160&\".maxOutput\",\"WETLabsCalData.Scatter_\"&$B$160&\".wavelength\")","v":"WETLabsCalData.CDOM.maxOutput"},4130,{"$f":"IF($B$160=\"CDOM\",\"counts\",\"nm\")","v":"counts"}]
[{"$f":"IF($B$160=\"CDOM\",\"WETLabsCalData.\"&$B$160&\".scaleFactor\",\"WETLabsCalData.Scatter_\"&$B$160&\".scaleFactor\")","v":"WETLabsCalData.CDOM.scaleFactor"},6.7699999999999996E-2,{"$f":"IF($B$160=\"CDOM\",\"ppb/count\",\"(m^-1sr^-1)/counts\")","v":"ppb/count"}]
[{"$f":"IF($B$160=\"CDOM\",\"WETLabsCalData.\"&$B$160&\".darkCounts\",\"WETLabsCalData.Scatter_\"&$B$160&\".darkCounts\")","v":"WETLabsCalData.CDOM.darkCounts"},28,"counts"]
[{"$f":"IF($B$160=\"CDOM\",\"WETLabsCalData.\"&$B$160&\".resolution\",\"WETLabsCalData.Scatter_\"&$B$160&\".resolution\")","v":"WETLabsCalData.CDOM.resolution"},1.4,"counts"]
[{"$f":"IF($B$160=\"CDOM\",\"WETLabsCalData.CDOM.calTemperature\",\"\")","v":"WETLabsCalData.CDOM.calTemperature"},20,{"$f":"IF($B$160=\"CDOM\",\"C\",\"\")","v":"C"}]
[]
["Scattering Sensor","650",{"$f":"IF($B$167=\"470\",\"(BLUE)\",IF($B$167=\"532\",\"(GREEN)\",IF($B$167=\"650\",\"(RED)\",IF($B$167=\"880\",\"(PINK)\",\"None\"))))","v":"(RED)"}]
[{"$f":"\"WETLabsCalData.Scatter_\"&$B$167&\".wavelength\"","v":"WETLabsCalData.Scatter_650.wavelength"},{"$f":"IF($B$167=\"None\",0,$B$167)","v":"650"},"nm"]
[{"$f":"\"WETLabsCalData.Scatter_\"&$B$167&\".scaleFactor\"","v":"WETLabsCalData.Scatter_650.scaleFactor"},4.5349999999999998E-6,"(m^-1sr^-1)/counts"]
[{"$f":"\"WETLabsCalData.Scatter_\"&$B$167&\".darkCounts\"","v":"WETLabsCalData.Scatter_650.darkCounts"},42,"counts"]
[{"$f":"\"WETLabsCalData.Scatter_\"&$B$167&\".resolution\"","v":"WETLabsCalData.Scatter_650.resolution"},1.1000000000000001,"counts"]
[]
[]
["Aft",null,"cal date","2016-01-13"]
["Manufacturer","Wetlab"]
["Model",{"$f":"IF($B$186=\"CDOM\",\"BBFL2\",IF($B$186 & $B$193=\"NoneNone\",\"None\",\"BB2FL\"))","v":"BB2FL"}]
["Serial #",{"$f":"'Weight sheet'!$H$130","v":"1390"}]
[]
["Chlorophyll  A Sensor","Chlorophyll"]
[{"$f":"\"WETLabsCalData.\"&$B$179&\".darkCounts\"","v":"WETLabsCalData.Chlorophyll.darkCounts"},37,"counts"]
[{"$f":"\"WETLabsCalData.\"&$B$179&\".scaleFactor\"","v":"WETLabsCalData.Chlorophyll.scaleFactor"},1.1900000000000001E-2,"ug/l/count"]
[{"$f":"\"WETLabsCalData.\"&$B$179&\".maxOutput\"","v":"WETLabsCalData.Chlorophyll.maxOutput"},4140,"counts"]
[{"$f":"\"WETLabsCalData.\"&$B$179&\".resolution\"","v":"WETLabsCalData.Chlorophyll.resolution"},1.7,"counts"]
[{"$f":"\"WETLabsCalData.\"&$B$179&\".calTemperature\"","v":"WETLabsCalData.Chlorophyll.calTemperature"},22.3,"C"]
[]
["CDOM or Scattering  Sensor","470",{"$f":"IF($B$186=\"470\",\"(BLUE)\",IF($B$186=\"532\",\"(GREEN)\",IF($B$186=\"650\",\"(RED)\",IF($B$186=\"880\",\"(PINK)\",\"\"))))","v":"(BLUE)"}]
[{"$f":"IF($B$186=\"CDOM\",\"WETLabsCalData.\"&$B$186&\".maxOutput\",\"WETLabsCalData.Scatter_\"&$B$186&\".wavelength\")","v":"WETLabsCalData.Scatter_470.wavelength"},{"$f":"IF($B$186=\"None\",0,$B$186)","v":"470"},{"$f":"IF($B$186=\"CDOM\",\"counts\",\"nm\")","v":"nm"}]
[{"$f":"IF($B$186=\"CDOM\",\"WETLabsCalData.\"&$B$186&\".scaleFactor\",\"WETLabsCalData.Scatter_\"&$B$186&\".scaleFactor\")","v":"WETLabsCalData.Scatter_470.scaleFactor"},1.081E-5,{"$f":"IF($B$186=\"CDOM\",\"ppb/count\",\"(m^-1sr^-1)/counts\")","v":"(m^-1sr^-1)/counts"}]
[{"$f":"IF($B$186=\"CDOM\",\"WETLabsCalData.\"&$B$186&\".darkCounts\",\"WETLabsCalData.Scatter_\"&$B$186&\".darkCounts\")","v":"WETLabsCalData.Scatter_470.darkCounts"},45,"counts"]
[{"$f":"IF($B$186=\"CDOM\",\"WETLabsCalData.\"&$B$186&\".resolution\",\"WETLabsCalData.Scatter_\"&$B$186&\".resolution\")","v":"WETLabsCalData.Scatter_470.resolution"},1,"counts"]
[{"$f":"IF($B$186=\"CDOM\",\"WETLabsCalData.CDOM.calTemperature\",\"\")","v":""},null,{"$f":"IF($B$186=\"CDOM\",\"C\",\"\")","v":""}]
[]
["Scattering Sensor","700",{"$f":"IF($B$193=\"470\",\"(BLUE)\",IF($B$193=\"532\",\"(GREEN)\",IF($B$193=\"650\",\"(RED)\",IF($B$193=\"880\",\"(PINK)\",\"None\"))))","v":"None"}]
[{"$f":"\"WETLabsCalData.Scatter_\"&$B$193&\".wavelength\"","v":"WETLabsCalData.Scatter_700.wavelength"},{"$f":"IF($B$193=\"None\",0,$B$193)","v":"700"},"nm"]
[{"$f":"\"WETLabsCalData.Scatter_\"&$B$193&\".scaleFactor\"","v":"WETLabsCalData.Scatter_700.scaleFactor"},3.0029999999999999E-6,"(m^-1sr^-1)/counts"]
[{"$f":"\"WETLabsCalData.Scatter_\"&$B$193&\".darkCounts\"","v":"WETLabsCalData.Scatter_700.darkCounts"},53,"counts"]
[{"$f":"\"WETLabsCalData.Scatter_\"&$B$193&\".resolution\"","v":"WETLabsCalData.Scatter_700.resolution"},1.2,"counts"]
[]
["Dissolved Oxygen Sensor - Seabird",null,"Last updated","2016-03-10"]
[null,null,"cal date","2015-12-18"]
["Manufacturer","SBE","Sea-Bird 43f coefficients"]
["Model","43f","Soc = ",2.5239000000000001E-4]
["Serial #",{"$f":"'Weight sheet'!$H$116","v":"0221"},"Boc =","NA"]
["Oxygen PCB  Serial #",{"$f":"'Weight sheet'!$H$445","v":0},"Tcor =","NA"]
[null,null,"Pcor =","NA"]
[null,null,"Foffset=",-826.68]
[null,null,"A=",-4.7269E-3]
[null,null,"B=",2.4573999999999999E-4]
[null,null,"C=",-3.6144999999999999E-6]
[null,null,"E=",3.5999999999999997E-2]
[null,null,"Tau20=",1.54]
[]
["Dissolved Oxygen Sensor - Aanderaa",null,"Last updated","2014-11-03"]
[null,null,"cal date","2016-03-04"]
["Manufacturer","Aa","Aanderaa coefficients",null,null,"FoilCoefA",null,"FoilCoefB"]
["Model","optode","optode_FoilCoefA1",null,null,0,-3.6047879999999999E-6,0,-7.9348240000000001E-7]
["Serial #",{"$f":" 'Weight sheet'!$H$110","v":"199"},"optode_FoilCoefA2",null,null,1,-6.8436580000000003E-6,1,3792.4110000000001]
[null,null,"optode_FoilCoefA3",null,null,2,1.839203E-3,2,-49.35136]
[null,null,"optode_FoilCoefA4",null,null,3,-0.19844419999999999,3,0.633521]
[null,null,"optode_FoilCoefA5",null,null,4,8.1212250000000004E-4,4,-1.085494E-2]
[null,null,"optode_FoilCoefA6",null,null,5,-1.2207330000000001E-6,5,1.2189530000000001E-4]
[null,null,"optode_FoilCoefA7",null,null,6,10.86894,6,-7.3449720000000003E-7]
[null,null,"optode_FoilCoefA8",null,null,7,-7.0939840000000004E-2,7,0]
[null,null,"optode_FoilCoefA9",null,null,8,2.8104669999999999E-4,8,0]
[null,null,"optode_FoilCoefA10",null,null,9,-1.32885E-6,9,0]
[null,null,"optode_FoilCoefA11",null,null,10,-309.375,10,0]
[null,null,"optode_FoilCoefA12",null,null,11,2.9236870000000001,11,0]
[null,null,"optode_FoilCoefA13",null,null,12,-2.2220110000000001E-2,12,0]
[null,null,"optode_FoilCoefB1",null,null,13,2.1463379999999999E-4,13,0]
[null,null,"optode_FoilCoefB2"]
[null,null,"optode_FoilCoefB3",null,null,"Phase"]
[null,null,"optode_FoilCoefB4",null,null,0,-5.9543419999999996]
[null,null,"optode_FoilCoefB5",null,null,1,1.1082920000000001]
[null,null,"optode_FoilCoefB6",null,null,2,0]
[null,null,null,null,null,3,0]
["Pumped Dissolved Oxygen Sensor - Seabird",null,"Last updated","xx/xx/xx"]
[null,null,"cal date","xx/xx/xx"]
["Manufacturer","SBE","Sea-Bird 43f coefficients"]
["Model","43f","Soc = "]
["Serial #",{"$f":"'Weight sheet'!$H$151","v":0},"Boc ="]
[null,null,"Tcor ="]
[null,null,"Pcor ="]
[null,null,"Foffset="]
[null,null,"A="]
[null,null,"B="]
[null,null,"C="]
[null,null,"E="]
[null,null,"Tau20="]
[]
["SBE CTD Sensor",null,"Last updated","xx/xx/xx"]
[null,null,null,"Comments"]
["SBE CTD  Serial #:",{"$f":"'Weight sheet'!$H$146","v":0}]
["SBE CTD PUMP  Serial #:",{"$f":"'Weight sheet'!$H$148","v":0}]
["SBE Calibration date:","xx/xx/xx"]
[]
[]
["PAR Sensor",null,"Last updated","xx/xx/xx"]
[null,null,null,"Comments"]
["Model","QSP 2150"]
["Manufacturer","Biospherical Instruments, Inc"]
["PAR  Serial #:",{"$f":"'Weight sheet'!$H$165","v":0}]
["PAR Calibration date:","xx/xx/xx"]
[null,null,"PAR_CalData(1).darkOffset=",null,"mv"]
[null,null,"PAR_CalData(1).scaleFactor=",null,"Volts/uE/cm^2sec"]
[]
["Radiation Detector Sensor",null,"Last updated","xx/xx/xx"]
[null,null,null,"Comments"]
["Model","?????"]
["Manufacturer","Princeton Gamma Tech"]
["PAR  Serial #:",{"$f":"'Weight sheet'!$H$173","v":0}]
["PAR Calibration date:","xx/xx/xx"]
[]
[]
[]
["Nortek ADCP Sensor",null,"Last updated","xx/xx/xx"]
[null,null,null,"Comments"]
["Assy, Nortek ADCP",{"$f":"'Weight sheet'!$H$182","v":0}]
["Nortek ADCP Calibration date:","xx/xx/xx"]
[null,null,"?="]
[null,null,"?="]
[null,null,"?="]
[]
["Imagenex ECHOSounder Sensor",null,"Last updated","xx/xx/xx"]
[null,null,null,"Comments"]
["Imagenex ECHOSounder : Serial #",{"$f":"'Weight sheet'!$H$189","v":0}]
["Imagenex ECHOSounder Calibration date:","xx/xx/xx"]
[null,null,"?="]
[null,null,"?="]
[null,null,"?="]
[]
["RAFOS Sensor ",null,"Last updated","xx/xx/xx"]
[null,null,null,"Comments"]
["RAFOS: Serial #",{"$f":"'Weight sheet'!$H$197","v":0}]
["RAFOS Calibration date:","xx/xx/xx"]
[null,null,"?="]
[null,null,"?="]
[null,null,"?="]
[]
["New Sensor #1  Sensor",null,"Last updated","xx/xx/xx"]
[null,null,null,"Comments"]
["New Sensor #1: Serial #",{"$f":"'Weight sheet'!$H$205","v":0}]
["New Sensor #1 Calibration date:","xx/xx/xx"]
[null,null,"?="]
[null,null,"?="]
[null,null,"?="]
[]
["New Sensor #2  Sensor",null,"Last updated","xx/xx/xx"]
[null,null,null,"Comments"]
["New Sensor #2: Serial #",{"$f":"'Weight sheet'!$H$213","v":0}]
["New Sensor #2 Calibration date:","xx/xx/xx"]
[null,null,"?="]
[null,null,"?="]
[null,null,"?="]

{"sheet":"Trim","index":2,"n_rows":523,"n_cols":19,"rows_kept":523,"cut":false,"hidden":false,"merged":[[17,13,18,14],[29,13,29,16],[9,4,9,7],[27,13,28,16]]}
["SEAGLIDER - Trim and Balance",null,null,"Date:",{"$f":"NOW()","v":"2016-08-29T14:22:50.640"}]
[null,"SG",{"$f":"Cal!$D$1","v":512},"Time:",{"$f":"NOW()","v":"2016-08-29T14:22:50.640"},null,null,null,null,null,null,null,"Spreadsheet Usage Notes from Russ Light"]
[null,null,null,null,null,null,"52524 = ALL UP WEIGHT"]
["Comments: ",null,null,null,null,null,"2014-11-21"]
[null,null,null,null,null,null,"53274 = ALL UP WEIGHT",null,null,null,null,null,null,"ERROR here:"]
[null,null,null,null,null,null,"2015-03-24",null,null,null,null,"Fwd Fairing assy scale wt:",{"$f":"Trim!$C$61","v":8518.2999999999993},"<--- uses weight including ballast!",{"$f":"Trim!$C$61","v":8518.2999999999993},"<-- includes nose ballast"]
[null,null,"Enter data only where font is RED",null,null,null,null,null,null,null,null,"Aft fairing assy scale wt:",{"$f":"Trim!$C$125","v":5741},"<-- Fairing, Wings, Rudder, Antenna",{"$f":"Trim!$C$125","v":5741}]
["Density Trim",null,null,null,null,null,null,null,null,null,null,"Fairing screws scale wt:",{"$f":"Trim!$E$56+Trim!$E$57","v":39.900000000000006},null,{"$f":"Trim!$E$56+Trim!$E$57","v":39.900000000000006}]
[null,"Total Weight (in air), summed items, corrected",{"$f":"Total_Weight","v":52652.000000000022},"gm",null,null,null,null,null,null,null,"Pupa assy w/lead scale wt:",{"$f":"'Weight sheet'!$H$231+SUM($F$68:$F$71)+SUM($F$76:$F$90)+SUM($F$97:$F$107)","v":39551.9},"<--- all ballast included",{"$f":"'Weight sheet'!$H$231+SUM($F$76:$F$90)+SUM($F$97:$F$107)","v":39051.599999999999},"<-- includes only PUPA ballast"]
[null,"Total Weight",{"$f":"'Weight sheet'!$H$2+SUM($F$68:$F$71)+SUM($F$76:$F$107)+SUM($F$118:$F$121)+SUM($F$255:$F$262)","v":52652.9},"gm",null,null,null,null,null,null,null,"Total glider wt by assy scale wts:",{"$f":"SUM($M$6:$M$9)","v":53851.1},null,{"$f":"SUM($O$6:$O$9)","v":53350.799999999996}]
[null,"Weight difference/\"error\"",{"$f":"$C$10-Total_Weight_In_Air","v":0.89999999997962732},"gm",null,null,null,null,null,null,null,"Actual",53274,"<<<25th march 2015",53274]
[null,"Variable wt, including nose-wt-plates",{"$f":"SUM($F$68:$F$107,$F$118:$F$121)","v":1097.8999999999996},"gm",null,null,null,null,null,null,null,"diff",{"$f":"$M$10-$M$11","v":577.09999999999854},null,{"$f":"$O$10-$O$11","v":76.799999999995634}]
[]
[]
[null,"Displaced Volume, measured in tank",{"$f":"Ballast!$H$14","v":50565},"cc","diff","see Ballast worksheet for more volume details"]
[null,"Displaced Volume, summed items",{"$f":"$K$53","v":51242.82238442824},"cc",{"$f":"Displaced_Volume-$C$15","v":677.82238442824018}]
[null,"volmax measured in tank",51775,null,{"$f":"Displaced_Volume-C17","v":-532.17761557175982}]
[null,"Water Density",1.0275000000000001,"gm/cc",null,"**volmax = 619cc (27mar15)",null,null,null,null,null,null,null,"See note to make Buttons work"]
[null,"Net Buoyancy (relative to neutral, positive floats, no thrust)",{"$f":"Displaced_Volume*rho_2-Total_Weight_In_Air","v":0},"cc",null,"predicted using this spreadsheet, actual may vary!"]
[null,"Internal Oil Stroke (100% is all inside, ext. bladder empty)",0.69334584524912846,null,{"$f":"Cal!$C$42+$C$20*(Cal!$C$43-Cal!$C$42)","v":2898.9766245619844},"A/D counts","(input %, not counts)"]
[null,"Set Target Stroke %",0.71299999999999997,null,"Target for Tank testing"]
[null,null,null,null,null,null,"($PITCH_VBD_SHIFT)",1.67E-3," cm per cc"]
["Pitch Trim "]
[null,"Longitudinal CG",{"$f":"Total_Moment_LCG/Total_Weight","v":89.924850128867249},"cm",{"$f":"$C$24/2.54","v":35.403484302703639},"inches"]
[null,"Longitudinal CB",{"$f":"Total_Moment_LCB/Displaced_Volume","v":89.924850128759658},"cm",{"$f":"$C$25/2.54","v":35.403484302661283},"inches"]
[null,"LCB-LCG Separation",{"$f":"$C$24-$C$25","v":1.0759038104879437E-10},"cm"]
[null,"Pitch-mass Stroke (100% is fully aft, nominal is 70%)",0.68353912163469888,null,{"$f":"Cal!$C$12+stroke_2*(Cal!$C$13-Cal!$C$12)","v":2735.0186193056002},"A/D counts","(input %, not counts)",null,null,"If % is lower than 63% add another nose plate "]
[null,"Pitch-mass (batt) Location",{"$f":"stroke_2*12.8","v":8.7493007569241463},"cm",null,null,null,null,null,"If % is greater than 77% remove another nose plate ",null,null,null,"Fairing density below was found in KUTI tank and then verified in the SeaTrial at Port Susan. RH 5/4/15"]
[null,"Vehicle Pitch Angle (positive is nose up)",{"$f":"DEGREES(ATAN($C$26/$C$33))","v":1.4899536009223317E-8},"deg","(goal is change of ~28 deg per cm travel, use goal-seek on Location by +/-1cm to test)"]
[null,null,null,null,null,null,null,null,null,null,null,null,1.54565,"<- Ref to Fairing Density for Macros"]
[null,"Vertical CG (VCG)",{"$f":"Tot_mom_VCG/Total_Weight_In_Air","v":-0.21389056142216814},"cm","(goal is ~ -0.45 from prior builds)",null,null,null,"range -0.35 t0 -0.65 from history",null,null,null,1.55266105532309,"old fairing density"]
[null,"Computed VCB",{"$f":"Tot_mom_VCB/Displaced_Volume","v":0.19984546005421977},"cm","(goal is ~0.07 from prior builds)",null,null,null,"range 0.05 to 0.1 from history",null,null,null,1.5745,"from Ross Feb15"]
[null,"VCB-VCG Separation",{"$f":"$C$32-$C$31","v":0.41373602147638788},"cm","(goal is ~0.53 from prior builds)",null,null,null,"range 0.4 to 0.65 from  history",null,null,null,1.5625,"before Dec 2015 Refurb"]
[null,"Roll-mass (batt) Angle",0,"deg"]
[null,null,null,null,null,null,null,null,null,null,null,null,1.5655703603812483]
[]
[null,null,null,null,null,"Total",null,null,"Moment",null,null,null,null,"Moment",null,null,"Moment","Moment"]
[null,null,"UW Part #","Qty","Weight","Weight","LCG","LCG","LCG","Volume","Total Vol","LCB","LCB","LCB","VCG&B","VCG&B","VCG","VCB"]
["Description","iRobot Part #","(or Assy Wt)",null,"grams","grams","inch","cm","gm-cm","cc","cc","inch","cm","cc-cm","inch","cm","gm-cm","cc-cm"]
[]
[null,"Complete fairing & antenna "]
[null,"Subtotal (summed) Weight",{"$f":"$C$60+$C$124+$C$112+$C$139","v":13481},"gm","diff"]
[null,"Scale Weight",{"$f":"$C$61+$C$125+$C$113+$C$140","v":14259.3},"gm",{"$f":"$C$43-$C$42","v":778.29999999999927}]
[null,"Summed volume",{"$f":"SUM($K$62:$K$230)","v":8493.9447841737783},"cc"]
[null,null,null,null,"sum-diff's",{"$f":"$E$43+$E$48","v":769.700000000008}]
[null,"Complete pupa"]
[null,"Subtotal (summed) Weight",{"$f":"$C$265","v":38462.599999999991},"gm","diff"]
[null,"Scale Weight",{"$f":"$C$266","v":38454},"gm",{"$f":"$C$48-$C$47","v":-8.5999999999912689}]
[null,"Summed volume",{"$f":"SUM($K$266:$K$524)+SUM($K$56:$K$57)","v":42748.877600254469},"cc"]
[]
[null,null,"Total weights and volume - Flying SG - without adjustment",null,null,{"$f":"SUM($F$55:$F$524)","v":52581.10000000002},null,null,{"$f":"SUM($I$55:$I$524)","v":4747419.2719851201},null,{"$f":"SUM($K$55:$K$524)","v":51242.82238442824},null,null,{"$f":"SUM($N$55:$N$524)","v":4608003.1230943603},null,null,{"$f":"SUM($Q$55:$Q$524)","v":-11261.765840000002},{"$f":"SUM($R$55:$R$524)","v":10240.645413892733}]
[null,null,"Adjustment to reflect trims found in tank & Port Susan",null,null,70.900000000000006,-70.5,{"$f":"$G$52*2.54","v":-179.07},{"$f":"$F$52*$H$52","v":-12696.063},0,{"$f":"$J$52*$D$52","v":0},0,{"$f":"$L$52*2.54","v":0},{"$f":"$K$52*$M$52","v":0},0,{"$f":"$O$52*2.54","v":0},{"$f":"$F$52*$P$52","v":0},{"$f":"$K$52*$P$52","v":0}]
[null,null,"Total weights and volume - Flying SG - adjusted, reported above",null,null,{"$f":"SUM($F$50:$F$52)","v":52652.000000000022},null,null,{"$f":"SUM($I$51:$I$52)","v":4734723.2089851201},null,{"$f":"SUM($K$51:$K$52)","v":51242.82238442824},null,null,{"$f":"SUM($N$51:$N$52)","v":4608003.1230943603},null,null,{"$f":"SUM($Q$51:$Q$52)","v":-11261.765840000002},{"$f":"SUM($R$51:$R$52)","v":10240.645413892733}]
[]
[{"$f":"'Weight sheet'!$B$5","v":"Flying Seaglider"},{"$f":"'Weight sheet'!$C$5","v":4197060},{"$f":"'Weight sheet'!$D$5","v":49801}]
[{"$f":"'Weight sheet'!$B$6","v":"(8x) 10-32 x 3/8 FHMS, joint ring to aft fairing"},{"$f":"'Weight sheet'!$C$6","v":4199128},{"$f":"'Weight sheet'!$D$6","v":55240},{"$f":"'Weight sheet'!$F$6","v":1},{"$f":"'Weight sheet'!$H$6","v":11.8},{"$f":"$E$56*$D$56","v":11.8},46,{"$f":"$G$56*2.54","v":116.84},{"$f":"$F$56*$H$56","v":1378.7120000000002},{"$f":"$E$56/SS_Density","v":1.4700386196586523},{"$f":"$J$56*$D$56","v":1.4700386196586523},{"$f":"$G$56","v":46},{"$f":"$L$56*2.54","v":116.84},{"$f":"$K$56*$M$56","v":171.75931232091693},0,{"$f":"$O$56*2.54","v":0},{"$f":"$F$56*$P$56","v":0},{"$f":"$K$56*$P$56","v":0}]
["(8x) 1/4-28 x 1/2 FHMS, Aft fairing to endcap",{"$f":"'Weight sheet'!$C$7","v":4199153},{"$f":"'Weight sheet'!$D$7","v":55294},{"$f":"'Weight sheet'!$F$7","v":1},{"$f":"'Weight sheet'!$H$7","v":28.1},{"$f":"$E$57*$D$57","v":28.1},49.5,{"$f":"$G$57*2.54","v":125.73},{"$f":"$F$57*$H$57","v":3533.0130000000004},{"$f":"$E$57/SS_Density","v":3.5006851874922145},{"$f":"$J$57*$D$57","v":3.5006851874922145},{"$f":"$G$57","v":49.5},{"$f":"$L$57*2.54","v":125.73},{"$f":"$K$57*$M$57","v":440.14114862339613},0,{"$f":"$O$57*2.54","v":0},{"$f":"$F$57*$P$57","v":0},{"$f":"$K$57*$P$57","v":0}]
[]
["Assy, Forward Fairing",{"$f":"'Weight sheet'!$C$9","v":4199433},{"$f":"'Weight sheet'!$D$9","v":55494}]
[null,"Subtotal Weight",{"$f":"IF($D$62=1,(SUM($F$62:$F$71,$F$211:$F$216)),0)","v":7744.3},"gm","diff"]
[null,"Scale Weight",{"$f":"'Weight sheet'!$H$11+SUMPRODUCT('Weight sheet'!$F$19:'Weight sheet'!$F$22,'Weight sheet'!$H$19:'Weight sheet'!$H$22)","v":8518.2999999999993},"gm",{"$f":"$C$61-$C$60","v":773.99999999999909}]
["Forward Fairing",{"$f":"'Weight sheet'!$C$13","v":4199347},{"$f":"'Weight sheet'!$D$13","v":49897},{"$f":"'Weight sheet'!$F$13","v":1},{"$f":"'Weight sheet'!$H$13","v":5308},{"$f":"$E$62*$D$62","v":5308},28.22,{"$f":"$G$62*2.54","v":71.678799999999995},{"$f":"$F$62*$H$62","v":380471.07039999997},{"$f":"$E$62/Fiberglass_Density","v":3434.1539158282922},{"$f":"$J$62*$D$62","v":3434.1539158282922},{"$f":"$G$62","v":28.22},{"$f":"$L$62*2.54","v":71.678799999999995},{"$f":"$K$62*$M$62","v":246156.03170187297},0,{"$f":"$O$62*2.54","v":0},{"$f":"$E$62*$P$62","v":0},{"$f":"$K$62*$P$62","v":0}]
[{"$f":"'Weight sheet'!$B$14","v":"Joint Ring, Fwd to Aft Fairing (bonded to fwd fairing before paint;  Long ring = 875g, short ring 688g )"},{"$f":"'Weight sheet'!$C$14","v":4199330},{"$f":"'Weight sheet'!$D$14","v":49834},{"$f":"'Weight sheet'!$F$14","v":1},{"$f":"'Weight sheet'!$H$14","v":688},{"$f":"$E$63*$D$63","v":688},45.85,{"$f":"$G$63*2.54","v":116.459},{"$f":"$F$63*$H$63","v":80123.792000000001},{"$f":"$E$63/Alum_density","v":253.59380759307038},{"$f":"$J$63*$D$63","v":253.59380759307038},{"$f":"$G$63","v":45.85},{"$f":"$L$63*2.54","v":116.459},{"$f":"$K$63*$M$63","v":29533.281238481384},0,{"$f":"$O$63*2.54","v":0},{"$f":"$F$63*$P$63","v":0},{"$f":"$K$63*$P$63","v":0}]
[{"$f":"'Weight sheet'!$B$15","v":"Nose weight (2 hole - bonded to fwd fairing after paint)"},{"$f":"'Weight sheet'!$C$15","v":4199334},{"$f":"'Weight sheet'!$D$15","v":49844},{"$f":"'Weight sheet'!$F$15","v":1},{"$f":"'Weight sheet'!$H$15","v":1248},{"$f":"$E$64*$D$64","v":1248},3.7149999999999999,{"$f":"$G$64*2.54","v":9.4360999999999997},{"$f":"$F$64*$H$64","v":11776.2528},{"$f":"$E$64/Brass_Density","v":148.3065953654189},{"$f":"$J$64*$D$64","v":148.3065953654189},{"$f":"$G$64","v":3.7149999999999999},{"$f":"$L$64*2.54","v":9.4360999999999997},{"$f":"$K$64*$M$64","v":1399.4358645276293},0,{"$f":"$O$64*2.54","v":0},{"$f":"$F$64*$P$64","v":0},{"$f":"$K$64*$P$64","v":0}]
[{"$f":"'Weight sheet'!$B$16","v":"Detachable Fairing Nose"},{"$f":"'Weight sheet'!$C$16","v":"??"},{"$f":"'Weight sheet'!$D$16","v":"??"},{"$f":"'Weight sheet'!$F$16","v":0},{"$f":"'Weight sheet'!$H$16","v":0},{"$f":"$E$65*$D$65","v":0},1.35,{"$f":"$G$65*2.54","v":3.4290000000000003},{"$f":"$F$65*$H$65","v":0},{"$f":"$E$65/Brass_Density","v":0},{"$f":"$J$65*$D$65","v":0},{"$f":"$G$65","v":1.35},{"$f":"$L$65*2.54","v":3.4290000000000003},{"$f":"$K$65*$M$65","v":0},0,{"$f":"$O$65*2.54","v":0},{"$f":"$F$65*$P$65","v":0},{"$f":"$K$65*$P$65","v":0}]
[{"$f":"'Weight sheet'!$B$17","v":"Nose Weight (5 hole)"},{"$f":"'Weight sheet'!$C$17","v":"??"},{"$f":"'Weight sheet'!$D$17","v":"??"},{"$f":"'Weight sheet'!$F$17","v":0},{"$f":"'Weight sheet'!$H$17","v":0},{"$f":"$E$66*$D$66","v":0},2.54,{"$f":"$G$66*2.54","v":6.4516},{"$f":"$F$66*$H$66","v":0},{"$f":"$E$66/Brass_Density","v":0},{"$f":"$J$66*$D$66","v":0},{"$f":"$G$66","v":2.54},{"$f":"$L$66*2.54","v":6.4516},{"$f":"$K$66*$M$66","v":0},0,{"$f":"$O$66*2.54","v":0},{"$f":"$F$66*$P$66","v":0},{"$f":"$K$66*$P$66","v":0}]
[{"$f":"'Weight sheet'!$B$18","v":"Nose Weight to Detachable Nose Screws"},{"$f":"'Weight sheet'!$C$18","v":4199435},{"$f":"'Weight sheet'!$D$18","v":"??"},{"$f":"'Weight sheet'!$F$18","v":0},{"$f":"'Weight sheet'!$H$18","v":0},{"$f":"$E$67*$D$67","v":0},3.42,{"$f":"$G$67*2.54","v":8.6867999999999999},{"$f":"$F$67*$H$67","v":0},{"$f":"$E$67/Brass_Density","v":0},{"$f":"$J$67*$D$67","v":0},{"$f":"$G$67","v":3.42},{"$f":"$L$67*2.54","v":8.6867999999999999},{"$f":"$K$67*$M$67","v":0},0,{"$f":"$O$67*2.54","v":0},{"$f":"$F$67*$P$67","v":0},{"$f":"$K$67*$P$67","v":0}]
[{"$f":"'Weight sheet'!$B$19","v":"Nose weight plates"},{"$f":"'Weight sheet'!$C$19","v":4199426},{"$f":"'Weight sheet'!$D$19","v":55448},1,{"$f":"'Weight sheet'!H19","v":479.7},{"$f":"$E$68*$D$68","v":479.7},3.7149999999999999,{"$f":"$G$68*2.54","v":9.4360999999999997},{"$f":"$F$68*$H$68","v":4526.4971699999996},{"$f":"$E$68/Brass_Density","v":57.00534759358289},{"$f":"$J$68*$D$68","v":57.00534759358289},{"$f":"$G$68","v":3.7149999999999999},{"$f":"$L$68*2.54","v":9.4360999999999997},{"$f":"$K$68*$M$68","v":537.9081604278075},0,{"$f":"$O$68*2.54","v":0},{"$f":"$F$68*$P$68","v":0},{"$f":"$K$68*$P$68","v":0}]
[{"$f":"'Weight sheet'!$B$20","v":"(2x) 1/4-20 x 2\" SHCS + 1/4 LW  brass, nose plate to nose base (4 - 5 plates)"},{"$f":"'Weight sheet'!$C$20","v":"/4199135"},{"$f":"'Weight sheet'!$D$20","v":"55186 / 55253"},0,{"$f":"IF('Weight sheet'!$H$20=0,'Weight sheet'!$G$20,'Weight sheet'!$H$20)","v":28.3},{"$f":"$E$69*$D$69","v":0},3.7149999999999999,{"$f":"$G$69*2.54","v":9.4360999999999997},{"$f":"$F$69*$H$69","v":0},{"$f":"$E$69/Brass_Density","v":3.3630421865715987},{"$f":"$J$69*$D$69","v":0},{"$f":"$G$69","v":3.7149999999999999},{"$f":"$L$69*2.54","v":9.4360999999999997},{"$f":"$K$69*$M$69","v":0},0,{"$f":"$O$69*2.54","v":0},{"$f":"$F$69*$P$69","v":0},{"$f":"$K$69*$P$69","v":0}]
[{"$f":"'Weight sheet'!$B$21","v":"(2x) 1/4-20 x 1.5\" SHCS + 1/4 LW  brass, nose plate to nose base (2 -3 plates)"},{"$f":"'Weight sheet'!$C$21","v":"4199112 / 4199135"},{"$f":"'Weight sheet'!$D$21","v":"55185 / 55253"},1,{"$f":"IF('Weight sheet'!$H$21=0,'Weight sheet'!$G$21,'Weight sheet'!$H$21)","v":20.6},{"$f":"$E$70*$D$70","v":20.6},3.7149999999999999,{"$f":"$G$70*2.54","v":9.4360999999999997},{"$f":"$F$70*$H$70","v":194.38366000000002},{"$f":"$E$70/Brass_Density","v":2.4480095068330368},{"$f":"$J$70*$D$70","v":2.4480095068330368},{"$f":"$G$70","v":3.7149999999999999},{"$f":"$L$70*2.54","v":9.4360999999999997},{"$f":"$K$70*$M$70","v":23.099662507427219},0,{"$f":"$O$70*2.54","v":0},{"$f":"$F$70*$P$70","v":0},{"$f":"$K$70*$P$70","v":0}]
[{"$f":"'Weight sheet'!$B$22","v":"(2x) 1/4-20 x .75\" SHCS + 1/4 LW  brass, nose plate to nose base (1 plate)"},{"$f":"'Weight sheet'!$C$22","v":"/4199135"},{"$f":"'Weight sheet'!$D$22","v":"55473 / 55253"},0,{"$f":"IF('Weight sheet'!$H$22=0,'Weight sheet'!$G$22,'Weight sheet'!$H$22)","v":18},{"$f":"$E$71*$D$71","v":0},3.7149999999999999,{"$f":"$G$71*2.54","v":9.4360999999999997},{"$f":"$F$71*$H$71","v":0},{"$f":"$E$71/Brass_Density","v":2.1390374331550803},{"$f":"$J$71*$D$71","v":0},{"$f":"$G$71","v":3.7149999999999999},{"$f":"$L$71*2.54","v":9.4360999999999997},{"$f":"$K$71*$M$71","v":0},0,{"$f":"$O$71*2.54","v":0},{"$f":"$F$71*$P$71","v":0},{"$f":"$K$71*$P$71","v":0}]
[]
[{"$f":"'Weight sheet'!$B$24","v":"Assy., Ballast (STANDARD)"}]
[null,"Subtotal Weight",{"$f":"SUM($F$76:$F$90)","v":597.6},"gm","diff"]
[null,"Scale Weight",{"$f":"'Weight sheet'!$H$26","v":597.6},"gm",{"$f":"$C$75-$C$74","v":0}]
[{"$f":"'Weight sheet'!$B$27","v":"Trim .600\" aft of pupa joint ring - bottom (5\" strip)"},null,null,1,173.3,{"$f":"ABS($E$76*$D$76)","v":173.3},42.076999999999998,{"$f":"$G$76*2.54","v":106.87558},{"$f":"ABS($F$76*$H$76)","v":18521.538014000002},{"$f":"IF($E$76<0,ABS($E$76/Material!$B$19),($E$76/Lead_Density))","v":15.341713881019832},{"$f":"$J$76*$D$76","v":15.341713881019832},{"$f":"$G$76","v":42.076999999999998},{"$f":"$L$76*2.54","v":106.87558},{"$f":"$K$76*$M$76","v":1639.6545692280456},-5.16,{"$f":"$O$76*2.54","v":-13.106400000000001},{"$f":"$F$76*$P$76","v":-2271.3391200000001},{"$f":"$K$76*$P$76","v":-201.07463881019834}]
[{"$f":"'Weight sheet'!$B$32","v":"EPDM base (5\"x6\") + (2x) 2\"x 6\" tape - bottom"},null,"not in BOM",{"$f":"'Weight sheet'!$F$32","v":0},{"$f":"'Weight sheet'!$H$32","v":0},{"$f":"$E$77*$D$77","v":0},42.076999999999998,{"$f":"$G$77*2.54","v":106.87558},{"$f":"ABS($F$77*$H$77)","v":0},{"$f":"$F$77/Material!$B$14","v":0},{"$f":"$J$77*$D$77","v":0},{"$f":"$G$77","v":42.076999999999998},{"$f":"$L$77*2.54","v":106.87558},{"$f":"$K$77*$M$77","v":0},-5,{"$f":"$O$77*2.54","v":-12.7},{"$f":"$F$77*$P$77","v":0},{"$f":"$K$77*$P$77","v":0}]
[{"$f":"'Weight sheet'!$B$28","v":"Trim .600\" aft of pupa joint ring - port side (5\" strip)"},null,null,0,0,{"$f":"ABS($E$78*$D$78)","v":0},42.08,{"$f":"$G$78*2.54","v":106.8832},{"$f":"ABS($F$78*$H$78)","v":0},{"$f":"IF($E$78<0,ABS($E$78/Material!$B$19),($E$78/Lead_Density))","v":0},{"$f":"$J$78*$D$78","v":0},{"$f":"$G$78","v":42.08},{"$f":"$L$78*2.54","v":106.8832},{"$f":"$K$78*$M$78","v":0},0,{"$f":"$O$78*2.54","v":0},{"$f":"$F$78*$P$78","v":0},{"$f":"$K$78*$P$78","v":0}]
[{"$f":"'Weight sheet'!$B$33","v":"EPDM base (5\"x6\") + (2x) 2\"x 6\" tape - port"},null,"not in BOM",{"$f":"'Weight sheet'!$F$33","v":1},{"$f":"'Weight sheet'!$H$33","v":20.8},{"$f":"$E$79*$D$79","v":20.8},42.076999999999998,{"$f":"$G$79*2.54","v":106.87558},{"$f":"ABS($F$79*$H$79)","v":2223.012064},{"$f":"$F$79/Material!$B$14","v":14.925373134328359},{"$f":"$J$79*$D$79","v":14.925373134328359},{"$f":"$G$79","v":42.076999999999998},{"$f":"$L$79*2.54","v":106.87558},{"$f":"$K$79*$M$79","v":1595.1579104477612},0,{"$f":"$O$79*2.54","v":0},{"$f":"$F$79*$P$79","v":0},{"$f":"$K$79*$P$79","v":0}]
[{"$f":"'Weight sheet'!$B$29","v":"Trim .600\" aft of pupa joint ring - starboard side (5\" strip)"},null,null,1,172.9,{"$f":"ABS($E$80*$D$80)","v":172.9},42.076999999999998,{"$f":"$G$80*2.54","v":106.87558},{"$f":"ABS($F$80*$H$80)","v":18478.787781999999},{"$f":"IF($E$80<0,ABS($E$80/Material!$B$19),($E$80/Lead_Density))","v":15.30630311614731},{"$f":"$J$80*$D$80","v":15.30630311614731},{"$f":"$G$80","v":42.076999999999998},{"$f":"$L$80*2.54","v":106.87558},{"$f":"$K$80*$M$80","v":1635.8700231940511},0,{"$f":"$O$80*2.54","v":0},{"$f":"$F$80*$P$80","v":0},{"$f":"$K$80*$P$80","v":0}]
[{"$f":"'Weight sheet'!$B$34","v":"EPDM base (5\"x6\") + (2x) 2\"x 6\" tape - starboard"},null,"not in BOM",{"$f":"'Weight sheet'!$F$34","v":1},{"$f":"'Weight sheet'!$H$34","v":19.8},{"$f":"$E$81*$D$81","v":19.8},42.076999999999998,{"$f":"$G$81*2.54","v":106.87558},{"$f":"ABS($F$81*$H$81)","v":2116.1364840000001},{"$f":"$F$81/Material!$B$14","v":14.20780711825488},{"$f":"$J$81*$D$81","v":14.20780711825488},{"$f":"$G$81","v":42.076999999999998},{"$f":"$L$81*2.54","v":106.87558},{"$f":"$K$81*$M$81","v":1518.4676262916189},0,{"$f":"$O$81*2.54","v":0},{"$f":"$F$81*$P$81","v":0},{"$f":"$K$81*$P$81","v":0}]
[{"$f":"'Weight sheet'!$B$30","v":"Trim .600\" aft of pupa joint ring - top (5\" strip)"},null,null,1,-184.1,{"$f":"ABS($E$82*$D$82)","v":184.1},42.076999999999998,{"$f":"$G$82*2.54","v":106.87558},{"$f":"ABS($F$82*$H$82)","v":19675.794277999998},{"$f":"IF($E$82<0,ABS($E$82/Material!$B$19),($E$82/Lead_Density))","v":438.33333333333331},{"$f":"$J$82*$D$82","v":438.33333333333331},{"$f":"$G$82","v":42.076999999999998},{"$f":"$L$82*2.54","v":106.87558},{"$f":"$K$82*$M$82","v":46847.129233333333},5.0999999999999996,{"$f":"$O$82*2.54","v":12.953999999999999},{"$f":"$F$82*$P$82","v":2384.8313999999996},{"$f":"$K$82*$P$82","v":5678.1699999999992}]
[{"$f":"'Weight sheet'!$B$35","v":"EPDM base (5\"x6\") + (2x) 2\"x 6\" tape - top"},null,"not in BOM",{"$f":"'Weight sheet'!$F$35","v":0},{"$f":"'Weight sheet'!$H$35","v":0},{"$f":"$E$83*$D$83","v":0},42.076999999999998,{"$f":"$G$83*2.54","v":106.87558},{"$f":"ABS($F$83*$H$83)","v":0},{"$f":"$F$83/Material!$B$14","v":0},{"$f":"$J$83*$D$83","v":0},{"$f":"$G$83","v":42.076999999999998},{"$f":"$L$83*2.54","v":106.87558},{"$f":"$K$83*$M$83","v":0},5,{"$f":"$O$83*2.54","v":12.7},{"$f":"$F$83*$P$83","v":0},{"$f":"$K$83*$P$83","v":0}]
[{"$f":"'Weight sheet'!$B$39","v":"Trim Lead tape (~1g per 5\" lead strip)"},null,"not in BOM",{"$f":"'Weight sheet'!$F$39","v":1},{"$f":"'Weight sheet'!$H$39","v":10.1},{"$f":"$E$84*$D$84","v":10.1},42.076999999999998,{"$f":"$G$84*2.54","v":106.87558},{"$f":"ABS($F$84*$H$84)","v":1079.443358},{"$f":"$E$84/PVC_Density","v":7.1631205673758869},{"$f":"$J$84*$D$84","v":7.1631205673758869},{"$f":"$G$84","v":42.076999999999998},{"$f":"$L$84*2.54","v":106.87558},{"$f":"$K$84*$M$84","v":765.56266524822695},5.0999999999999996,{"$f":"$O$84*2.54","v":12.953999999999999},{"$f":"$F$84*$P$84","v":130.83539999999999},{"$f":"$K$84*$P$84","v":92.791063829787234}]
[{"$f":"'Weight sheet'!$B$37","v":"(2) Straps - cut to length (start at 34g, subtract trimmed)"},null,null,{"$f":"'Weight sheet'!$F$37","v":0},{"$f":"'Weight sheet'!$H$37","v":0},{"$f":"$E$85*$D$85","v":0},42.076999999999998,{"$f":"$G$85*2.54","v":106.87558},{"$f":"ABS($F$85*$H$85)","v":0},{"$f":"$E$85/Material!$B$15","v":0},{"$f":"$J$85*$D$85","v":0},{"$f":"$G$85","v":42.076999999999998},{"$f":"$L$85*2.54","v":106.87558},{"$f":"$K$85*$M$85","v":0},0,{"$f":"$O$85*2.54","v":0},{"$f":"$F$85*$P$85","v":0},{"$f":"$K$85*$P$85","v":0}]
[{"$f":"'Weight sheet'!$B$41","v":"(2) black tape wraps over foam (1 1/2\" width)"},null,"not in BOM",{"$f":"'Weight sheet'!$F$41","v":1},{"$f":"'Weight sheet'!$H$41","v":14.6},{"$f":"($E$86*$D$86)","v":14.6},42.076999999999998,{"$f":"$G$86*2.54","v":106.87558},{"$f":"ABS($F$86*$H$86)","v":1560.383468},{"$f":"$F$86/Material!$B$10","v":10.354609929078014},{"$f":"$J$86*$D$86","v":10.354609929078014},{"$f":"$G$86","v":42.076999999999998},{"$f":"$L$86*2.54","v":106.87558},{"$f":"$K$86*$M$86","v":1106.6549418439718},0,{"$f":"$O$86*2.54","v":0},{"$f":"$F$86*$P$86","v":0},{"$f":"$K$86*$P$86","v":0}]
[{"$f":"'Weight sheet'!$B$31","v":"Trim 1.000\" fwd of bulkhead - bottom (5\" strip)"},null,null,0,0,{"$f":"($E$87*$D$87)","v":0},22.45,{"$f":"$G$87*2.54","v":57.022999999999996},{"$f":"ABS($F$87*$H$87)","v":0},{"$f":"IF($E$87<0,ABS($E$87/Material!$B$19),($E$87/Lead_Density))","v":0},{"$f":"$J$87*$D$87","v":0},{"$f":"$G$87","v":22.45},{"$f":"$L$87*2.54","v":57.022999999999996},{"$f":"$K$87*$M$87","v":0},-4.0350000000000001,{"$f":"$O$87*2.54","v":-10.248900000000001},{"$f":"$F$87*$P$87","v":0},{"$f":"$K$87*$P$87","v":0}]
["EPDM base (5\"x6\") + (2x) 2\"x 6\" tape - fwd of bulkhead - bottom",null,"not in BOM",{"$f":"'Weight sheet'!$F$36","v":0},{"$f":"'Weight sheet'!$H$36","v":0},{"$f":"$E$88*$D$88","v":0},22.45,{"$f":"$G$88*2.54","v":57.022999999999996},{"$f":"ABS($F$88*$H$88)","v":0},{"$f":"$F$88/Material!$B$14","v":0},{"$f":"$J$88*$D$88","v":0},{"$f":"$G$88","v":22.45},{"$f":"$L$88*2.54","v":57.022999999999996},{"$f":"$K$88*$M$88","v":0},-4.0350000000000001,{"$f":"$O$88*2.54","v":-10.248900000000001},{"$f":"$F$88*$P$88","v":0},{"$f":"$K$88*$P$88","v":0}]
["Trim Lead tape (~1g per 5\" lead strip) -fwd of bulkhead - bottom",null,null,{"$f":"'Weight sheet'!$F$40","v":1},{"$f":"'Weight sheet'!$H$40","v":2},{"$f":"$E$89*$D$89","v":2},22.45,{"$f":"$G$89*2.54","v":57.022999999999996},{"$f":"ABS($F$89*$H$89)","v":114.04599999999999},{"$f":"$E$89/PVC_Density","v":1.4184397163120568},{"$f":"$J$89*$D$89","v":1.4184397163120568},{"$f":"$G$89","v":22.45},{"$f":"$L$89*2.54","v":57.022999999999996},{"$f":"$K$89*$M$89","v":80.883687943262402},-4.0350000000000001,{"$f":"$O$89*2.54","v":-10.248900000000001},{"$f":"$F$89*$P$89","v":-20.497800000000002},{"$f":"$K$89*$P$89","v":-14.537446808510641}]
[{"$f":"'Weight sheet'!$B$38","v":"(2) Straps - cut to length (start at 17g, subtract trimmed) fwd of bulkhead"},null,"not in BOM",{"$f":"'Weight sheet'!$F$38","v":0},{"$f":"'Weight sheet'!$H$38","v":0},{"$f":"$E$90*$D$90","v":0},22.45,{"$f":"$G$90*2.54","v":57.022999999999996},{"$f":"ABS($F$90*$H$90)","v":0},{"$f":"$E$90/Material!$B$15","v":0},{"$f":"$J$90*$D$90","v":0},{"$f":"$G$90","v":22.45},{"$f":"$L$90*2.54","v":57.022999999999996},{"$f":"$K$90*$M$90","v":0},-4.0350000000000001,{"$f":"$O$90*2.54","v":-10.248900000000001},{"$f":"$F$90*$P$90","v":0},{"$f":"$K$90*$P$90","v":0}]
[null,"lead goal",1310]
[null,"currently at",1159.7999999999997,150.20000000000027,"diff"]
[]
[{"$f":"'Weight sheet'!$B$43","v":"Assy., Ballast (BATTERY HULL FORWARD JOINT RING)"}]
[null,"Subtotal Weight",{"$f":"SUM($F$97:$F$107)","v":0},"gm","diff"]
[null,"Scale Weight",{"$f":"'Weight sheet'!$H$45","v":0},"gm",{"$f":"$C$96-$C$95","v":0}]
[{"$f":"'Weight sheet'!$B$46","v":"Trim .600\" aft of pupa joint ring - bottom (5\" strip)"},null,null,0,0,{"$f":"ABS($E$97*$D$97)","v":0},34.08,{"$f":"$G$97*2.54","v":86.563199999999995},{"$f":"ABS($F$97*$H$97)","v":0},{"$f":"IF($E$97<0,ABS($E$97/Material!$B$19),($E$97/Lead_Density))","v":0},{"$f":"$J$97*$D$97","v":0},{"$f":"$G$97","v":34.08},{"$f":"$L$97*2.54","v":86.563199999999995},{"$f":"$K$97*$M$97","v":0},-5.16,{"$f":"$O$97*2.54","v":-13.106400000000001},{"$f":"$F$97*$P$97","v":0},{"$f":"$K$97*$P$97","v":0}]
[{"$f":"'Weight sheet'!$B$50","v":"EPDM base (5\"x6\") + (2x) 2\"x 6\" tape - bottom"},null,"not in BOM",{"$f":"'Weight sheet'!$F$50","v":0},{"$f":"'Weight sheet'!$H$50","v":0},{"$f":"$E$98*$D$98","v":0},34.08,{"$f":"$G$98*2.54","v":86.563199999999995},{"$f":"ABS($F$98*$H$98)","v":0},{"$f":"$F$98/Material!$B$14","v":0},{"$f":"$J$98*$D$98","v":0},{"$f":"$G$98","v":34.08},{"$f":"$L$98*2.54","v":86.563199999999995},{"$f":"$K$98*$M$98","v":0},-5,{"$f":"$O$98*2.54","v":-12.7},{"$f":"$F$98*$P$98","v":0},{"$f":"$K$98*$P$98","v":0}]
[{"$f":"'Weight sheet'!$B$47","v":"Trim .600\" aft of pupa joint ring - port side (5\" strip)"},null,null,0,0,{"$f":"ABS($E$99*$D$99)","v":0},34.08,{"$f":"$G$99*2.54","v":86.563199999999995},{"$f":"ABS($F$99*$H$99)","v":0},{"$f":"IF($E$99<0,ABS($E$99/Material!$B$19),($E$99/Lead_Density))","v":0},{"$f":"$J$99*$D$99","v":0},{"$f":"$G$99","v":34.08},{"$f":"$L$99*2.54","v":86.563199999999995},{"$f":"$K$99*$M$99","v":0},0,{"$f":"$O$99*2.54","v":0},{"$f":"$F$99*$P$99","v":0},{"$f":"$K$99*$P$99","v":0}]
[{"$f":"'Weight sheet'!$B$51","v":"EPDM base (5\"x6\") + (2x) 2\"x 6\" tape - port"},null,"not in BOM",{"$f":"'Weight sheet'!$F$51","v":0},{"$f":"'Weight sheet'!$H$51","v":0},{"$f":"$E$100*$D$100","v":0},34.08,{"$f":"$G$100*2.54","v":86.563199999999995},{"$f":"ABS($F$100*$H$100)","v":0},{"$f":"$F$100/Material!$B$14","v":0},{"$f":"$J$100*$D$100","v":0},{"$f":"$G$100","v":34.08},{"$f":"$L$100*2.54","v":86.563199999999995},{"$f":"$K$100*$M$100","v":0},0,{"$f":"$O$100*2.54","v":0},{"$f":"$F$100*$P$100","v":0},{"$f":"$K$100*$P$100","v":0}]
[{"$f":"'Weight sheet'!$B$48","v":"Trim .600\" aft of pupa joint ring - starboard side (5\" strip)"},null,null,0,0,{"$f":"ABS($E$101*$D$101)","v":0},34.08,{"$f":"$G$101*2.54","v":86.563199999999995},{"$f":"ABS($F$101*$H$101)","v":0},{"$f":"IF($E$101<0,ABS($E$101/Material!$B$19),($E$101/Lead_Density))","v":0},{"$f":"$J$101*$D$101","v":0},{"$f":"$G$101","v":34.08},{"$f":"$L$101*2.54","v":86.563199999999995},{"$f":"$K$101*$M$101","v":0},0,{"$f":"$O$101*2.54","v":0},{"$f":"$F$101*$P$101","v":0},{"$f":"$K$101*$P$101","v":0}]
[{"$f":"'Weight sheet'!$B$52","v":"EPDM base (5\"x6\") + (2x) 2\"x 6\" tape - starboard"},null,"not in BOM",{"$f":"'Weight sheet'!$F$52","v":0},{"$f":"'Weight sheet'!$H$52","v":0},{"$f":"$E$102*$D$102","v":0},34.08,{"$f":"$G$102*2.54","v":86.563199999999995},{"$f":"ABS($F$102*$H$102)","v":0},{"$f":"$F$102/Material!$B$14","v":0},{"$f":"$J$102*$D$102","v":0},{"$f":"$G$102","v":34.08},{"$f":"$L$102*2.54","v":86.563199999999995},{"$f":"$K$102*$M$102","v":0},0,{"$f":"$O$102*2.54","v":0},{"$f":"$F$102*$P$102","v":0},{"$f":"$K$102*$P$102","v":0}]
[{"$f":"'Weight sheet'!$B$49","v":"Trim .600\" aft of pupa joint ring - top (5\" strip)"},null,null,0,0,{"$f":"ABS($E$103*$D$103)","v":0},34.08,{"$f":"$G$103*2.54","v":86.563199999999995},{"$f":"ABS($F$103*$H$103)","v":0},{"$f":"IF($E$103<0,ABS($E$103/Material!$B$19),($E$103/Lead_Density))","v":0},{"$f":"$J$103*$D$103","v":0},{"$f":"$G$103","v":34.08},{"$f":"$L$103*2.54","v":86.563199999999995},{"$f":"$K$103*$M$103","v":0},5.0999999999999996,{"$f":"$O$103*2.54","v":12.953999999999999},{"$f":"$F$103*$P$103","v":0},{"$f":"$K$103*$P$103","v":0}]
[{"$f":"'Weight sheet'!$B$53","v":"EPDM base (5\"x6\") + (2x) 2\"x 6\" tape - top"},null,"not in BOM",{"$f":"'Weight sheet'!$F$53","v":0},{"$f":"'Weight sheet'!$H$53","v":0},{"$f":"$E$104*$D$104","v":0},34.08,{"$f":"$G$104*2.54","v":86.563199999999995},{"$f":"ABS($F$104*$H$104)","v":0},{"$f":"$F$104/Material!$B$14","v":0},{"$f":"$J$104*$D$104","v":0},{"$f":"$G$104","v":34.08},{"$f":"$L$104*2.54","v":86.563199999999995},{"$f":"$K$104*$M$104","v":0},5,{"$f":"$O$104*2.54","v":12.7},{"$f":"$F$104*$P$104","v":0},{"$f":"$K$104*$P$104","v":0}]
[{"$f":"'Weight sheet'!$B$55","v":"Trim Lead tape (~1g per 5\" lead strip)"},null,"not in BOM",{"$f":"'Weight sheet'!$F$55","v":0},{"$f":"'Weight sheet'!$H$55","v":0},{"$f":"$E$105*$D$105","v":0},34.08,{"$f":"$G$105*2.54","v":86.563199999999995},{"$f":"ABS($F$105*$H$105)","v":0},{"$f":"$E$105/PVC_Density","v":0},{"$f":"$J$105*$D$105","v":0},{"$f":"$G$105","v":34.08},{"$f":"$L$105*2.54","v":86.563199999999995},{"$f":"$K$105*$M$105","v":0},5.0999999999999996,{"$f":"$O$105*2.54","v":12.953999999999999},{"$f":"$F$105*$P$105","v":0},{"$f":"$K$105*$P$105","v":0}]
[{"$f":"'Weight sheet'!$B$54","v":"(2) Straps - cut to length (start at 34g, subtract trimmed)"},null,null,{"$f":"'Weight sheet'!$F$54","v":0},{"$f":"'Weight sheet'!$H$54","v":0},{"$f":"$E$106*$D$106","v":0},34.08,{"$f":"$G$106*2.54","v":86.563199999999995},{"$f":"ABS($F$106*$H$106)","v":0},{"$f":"$E$106/Material!$B$15","v":0},{"$f":"$J$106*$D$106","v":0},{"$f":"$G$106","v":34.08},{"$f":"$L$106*2.54","v":86.563199999999995},{"$f":"$K$106*$M$106","v":0},0,{"$f":"$O$106*2.54","v":0},{"$f":"$F$106*$P$106","v":0},{"$f":"$K$106*$P$106","v":0}]
[{"$f":"'Weight sheet'!$B$56","v":"(2) black tape wraps over foam (1 1/2\" width)"},null,"not in BOM",{"$f":"'Weight sheet'!$F$56","v":0},{"$f":"'Weight sheet'!$H$56","v":0},{"$f":"($E$107*$D$107)","v":0},34.08,{"$f":"$G$107*2.54","v":86.563199999999995},{"$f":"ABS($F$107*$H$107)","v":0},{"$f":"$F$107/Material!$B$10","v":0},{"$f":"$J$107*$D$107","v":0},{"$f":"$G$107","v":34.08},{"$f":"$L$107*2.54","v":86.563199999999995},{"$f":"$K$107*$M$107","v":0},0,{"$f":"$O$107*2.54","v":0},{"$f":"$F$107*$P$107","v":0},{"$f":"$K$107*$P$107","v":0}]
[null,"lead goal",1310]
[null,"currently at",1159.7999999999997,150.20000000000027,"diff"]
[]
[{"$f":"'Weight sheet'!$B$58","v":"Assy, Ojive Forward Fairing"},{"$f":"'Weight sheet'!$C$58","v":4199433},{"$f":"'Weight sheet'!$D$58","v":55494}]
[null,"Subtotal Weight",{"$f":"IF($D$114=1,(SUM($F$114:$F$121,$F$211:$F$216)),0)","v":0},"gm","diff"]
[null,"Scale Weight",{"$f":"'Weight sheet'!$H$60+SUMPRODUCT('Weight sheet'!$F$65:'Weight sheet'!$F$68,'Weight sheet'!$H$65:'Weight sheet'!$H$68)","v":0},"gm",{"$f":"$C$113-$C$112","v":0}]
[{"$f":"'Weight sheet'!$B$61","v":"Ojive Forward Fairing"},{"$f":"'Weight sheet'!$C$61","v":"??"},{"$f":"'Weight sheet'!$D$61","v":"??"},{"$f":"'Weight sheet'!$F$61","v":0},{"$f":"'Weight sheet'!$H$61","v":0},{"$f":"$E$114*$D$114","v":0},30.72,{"$f":"$G$114*2.54","v":78.028800000000004},{"$f":"$F$114*$H$114","v":0},{"$f":"$E$114/Fiberglass_Density","v":0},{"$f":"$J$114*$D$114","v":0},{"$f":"$G$114","v":30.72},{"$f":"$L$114*2.54","v":78.028800000000004},{"$f":"$K$114*$M$114","v":0},0,{"$f":"$O$114*2.54","v":0},{"$f":"$E$114*$P$114","v":0},{"$f":"$K$114*$P$114","v":0}]
[{"$f":"'Weight sheet'!$B$62","v":"Detacable Fairing Nose"},{"$f":"'Weight sheet'!$C$62","v":"??"},{"$f":"'Weight sheet'!$D$62","v":"??"},{"$f":"'Weight sheet'!$F$62","v":0},{"$f":"'Weight sheet'!$H$62","v":0},{"$f":"$E$115*$D$115","v":0},1.35,{"$f":"$G$115*2.54","v":3.4290000000000003},{"$f":"$F$115*$H$115","v":0},{"$f":"$E$115/Material!$B$21","v":0},{"$f":"$J$115*$D$115","v":0},{"$f":"$G$115","v":1.35},{"$f":"$L$115*2.54","v":3.4290000000000003},{"$f":"$K$115*$M$115","v":0},0,{"$f":"$O$115*2.54","v":0},{"$f":"$F$115*$P$115","v":0},{"$f":"$K$115*$P$115","v":0}]
[{"$f":"'Weight sheet'!$B$63","v":"Nose weight (5 hole)"},{"$f":"'Weight sheet'!$C$63","v":"??"},{"$f":"'Weight sheet'!$D$63","v":49844},{"$f":"'Weight sheet'!$F$63","v":0},{"$f":"'Weight sheet'!$H$63","v":0},{"$f":"$E$116*$D$116","v":0},2.54,{"$f":"$G$116*2.54","v":6.4516},{"$f":"$F$116*$H$116","v":0},{"$f":"$E$116/Brass_Density","v":0},{"$f":"$J$116*$D$116","v":0},{"$f":"$G$116","v":2.54},{"$f":"$L$116*2.54","v":6.4516},{"$f":"$K$116*$M$116","v":0},0,{"$f":"$O$116*2.54","v":0},{"$f":"$F$116*$P$116","v":0},{"$f":"$K$116*$P$116","v":0}]
[{"$f":"'Weight sheet'!$B$64","v":"Nose weight to detachable nose screws"},{"$f":"'Weight sheet'!$C$64","v":4199435},{"$f":"'Weight sheet'!$D$64","v":0},{"$f":"'Weight sheet'!$F$64","v":0},{"$f":"'Weight sheet'!$H$64","v":0},{"$f":"$E$117*$D$117","v":0},3.42,{"$f":"$G$117*2.54","v":8.6867999999999999},{"$f":"$F$117*$H$117","v":0},{"$f":"$E$117/Brass_Density","v":0},{"$f":"$J$117*$D$117","v":0},{"$f":"$G$117","v":3.42},{"$f":"$L$117*2.54","v":8.6867999999999999},{"$f":"$K$117*$M$117","v":0},0,{"$f":"$O$117*2.54","v":0},{"$f":"$F$117*$P$117","v":0},{"$f":"$K$117*$P$117","v":0}]
[{"$f":"'Weight sheet'!$B$65","v":"Nose weight plates"},{"$f":"'Weight sheet'!$C$65","v":4199426},{"$f":"'Weight sheet'!$D$65","v":55448},0,{"$f":"'Weight sheet'!$H$65","v":0},{"$f":"$E$118*$D$118","v":0},4.88,{"$f":"$G$118*2.54","v":12.395199999999999},{"$f":"$F$118*$H$118","v":0},{"$f":"$E$118/Brass_Density","v":0},{"$f":"$J$118*$D$118","v":0},{"$f":"$G$118","v":4.88},{"$f":"$L$118*2.54","v":12.395199999999999},{"$f":"$K$118*$M$118","v":0},0,{"$f":"$O$118*2.54","v":0},{"$f":"$F$118*$P$118","v":0},{"$f":"$K$118*$P$118","v":0}]
[{"$f":"'Weight sheet'!$B$66","v":"(2x) 1/4-20 x 2\" SHCS + 1/4 LW  brass, nose plate to nose base (4 - 5 plates)"},{"$f":"'Weight sheet'!$C$66","v":"/4199135"},{"$f":"'Weight sheet'!$D$66","v":"55186 / 55253"},0,{"$f":"'Weight sheet'!$H$66","v":0},{"$f":"$E$119*$D$119","v":0},4.8899999999999997,{"$f":"$G$119*2.54","v":12.420599999999999},{"$f":"$F$119*$H$119","v":0},{"$f":"$E$119/Brass_Density","v":0},{"$f":"$J$119*$D$119","v":0},{"$f":"$G$119","v":4.8899999999999997},{"$f":"$L$119*2.54","v":12.420599999999999},{"$f":"$K$119*$M$119","v":0},0,{"$f":"$O$119*2.54","v":0},{"$f":"$F$119*$P$119","v":0},{"$f":"$K$119*$P$119","v":0}]
[{"$f":"'Weight sheet'!$B$67","v":"(2x) 1/4-20 x 1.5\" SHCS + 1/4 LW  brass, nose plate to nose base (2 -3 plates)"},{"$f":"'Weight sheet'!$C$67","v":"4199112 / 4199135"},{"$f":"'Weight sheet'!$D$67","v":"55185 / 55253"},0,{"$f":"'Weight sheet'!$H$67","v":0},{"$f":"$E$120*$D$120","v":0},4.6399999999999997,{"$f":"$G$120*2.54","v":11.785599999999999},{"$f":"$F$120*$H$120","v":0},{"$f":"$E$120/Brass_Density","v":0},{"$f":"$J$120*$D$120","v":0},{"$f":"$G$120","v":4.6399999999999997},{"$f":"$L$120*2.54","v":11.785599999999999},{"$f":"$K$120*$M$120","v":0},0,{"$f":"$O$120*2.54","v":0},{"$f":"$F$120*$P$120","v":0},{"$f":"$K$120*$P$120","v":0}]
[{"$f":"'Weight sheet'!$B$68","v":"(2x) 1/4-20 x .75\" SHCS + 1/4 LW  brass, nose plate to nose base (1 plate)"},{"$f":"'Weight sheet'!$C$68","v":"/4199135"},{"$f":"'Weight sheet'!$D$68","v":"55473 / 55253"},0,{"$f":"'Weight sheet'!$H$68","v":0},{"$f":"$E$121*$D$121","v":0},4.3899999999999997,{"$f":"$G$121*2.54","v":11.150599999999999},{"$f":"$F$121*$H$121","v":0},{"$f":"$E$121/Brass_Density","v":0},{"$f":"$J$121*$D$121","v":0},{"$f":"$G$121","v":4.3899999999999997},{"$f":"$L$121*2.54","v":11.150599999999999},{"$f":"$K$121*$M$121","v":0},0,{"$f":"$O$121*2.54","v":0},{"$f":"$F$121*$P$121","v":0},{"$f":"$K$121*$P$121","v":0}]
[]
[{"$f":"'Weight sheet'!$B$70","v":"Assy., Standard Aft Fairing"},{"$f":"'Weight sheet'!$C$70","v":4199434},{"$f":"'Weight sheet'!$D$70","v":55497}]
[null,"Subtotal Weight",{"$f":"IF('Weight sheet'!$F$73=1,(SUM($F$126:$F$136,$F$152:$F$208,$F$221:$F$262)),0)","v":5736.7000000000007},"gm","diff"]
[null,"Scale Weight",{"$f":"'Weight sheet'!$H$72","v":5741},"gm",{"$f":"$C$125-$C$124","v":4.2999999999992724}]
[{"$f":"'Weight sheet'!$B$73","v":"Aft Fairing"},{"$f":"'Weight sheet'!$C$73","v":4199495},{"$f":"'Weight sheet'!$D$73","v":56972},{"$f":"'Weight sheet'!$F$73","v":1},{"$f":"'Weight sheet'!$H$73","v":2005},{"$f":"$E$126*$D$126","v":2005},54.87,{"$f":"$G$126*2.54","v":139.3698},{"$f":"$F$126*$H$126","v":279436.44900000002},{"$f":"$F$126/Fiberglass_Density","v":1297.1888849351405},{"$f":"$J$126*$D$126","v":1297.1888849351405},{"$f":"$G$126","v":54.87},{"$f":"$L$126*2.54","v":139.3698},{"$f":"$K$126*$M$126","v":180788.95545563355},-0.02,{"$f":"$O$126*2.54","v":-5.0800000000000005E-2},{"$f":"$F$126*$P$126","v":-101.85400000000001},{"$f":"$K$126*$P$126","v":-65.897195354705147}]
[{"$f":"'Weight sheet'!$B$74","v":"Wing, Starboard (1m)"},{"$f":"'Weight sheet'!$C$74","v":4199438},{"$f":"'Weight sheet'!$D$74","v":56751},{"$f":"'Weight sheet'!$F$74","v":1},{"$f":"'Weight sheet'!$H$74","v":644.9},{"$f":"$E$127*$D$127","v":644.9},{"$f":"$H$127/2.54","v":51.456692913385822},130.69999999999999,{"$f":"$F$127*$H$127","v":84288.43},{"$f":"$D$127*641.6","v":641.6},{"$f":"$J$127*$D$127","v":641.6},{"$f":"$G$127","v":51.456692913385822},{"$f":"$H$127","v":130.69999999999999},{"$f":"$K$127*$M$127","v":83857.119999999995},0,{"$f":"$O$127*2.54","v":0},{"$f":"$F$127*$P$127","v":0},{"$f":"$K$127*$P$127","v":0}]
[{"$f":"'Weight sheet'!$B$75","v":"Wing, Port  (1 m)"},{"$f":"'Weight sheet'!$C$75","v":4199438},{"$f":"'Weight sheet'!$D$75","v":56751},{"$f":"'Weight sheet'!$F$75","v":1},{"$f":"'Weight sheet'!$H$75","v":645.4},{"$f":"$E$128*$D$128","v":645.4},{"$f":"$H$128/2.54","v":51.456692913385822},130.69999999999999,{"$f":"$F$128*$H$128","v":84353.779999999984},{"$f":"$D$128*641.6","v":641.6},{"$f":"$J$128*$D$128","v":641.6},{"$f":"$G$128","v":51.456692913385822},{"$f":"$H$128","v":130.69999999999999},{"$f":"$K$128*$M$128","v":83857.119999999995},0,{"$f":"$O$128*2.54","v":0},{"$f":"$F$128*$P$128","v":0},{"$f":"$K$128*$P$128","v":0}]
[{"$f":"'Weight sheet'!$B$76","v":"(16x) 6-32 x 3/8 FHMS (WING SCREWS)"},{"$f":"'Weight sheet'!$C$76","v":4199270},{"$f":"'Weight sheet'!$D$76","v":56912},{"$f":"'Weight sheet'!$F$76","v":1},{"$f":"'Weight sheet'!$H$76","v":10.4},{"$f":"$E$129*$D$129","v":10.4},50,{"$f":"$G$129*2.54","v":127},{"$f":"$F$129*$H$129","v":1320.8},{"$f":"$E$129/SS_Density","v":1.2956272580042358},{"$f":"$J$129*$D$129","v":1.2956272580042358},{"$f":"$G$129","v":50},{"$f":"$L$129*2.54","v":127},{"$f":"$K$129*$M$129","v":164.54466176653796},0,{"$f":"$O$129*2.54","v":0},{"$f":"$F$129*$P$129","v":0},{"$f":"$K$129*$P$129","v":0}]
[{"$f":"'Weight sheet'!$B$77","v":"Rudder"},{"$f":"'Weight sheet'!$C$77","v":4199331},{"$f":"'Weight sheet'!$D$77","v":49839},{"$f":"'Weight sheet'!$F$77","v":1},{"$f":"'Weight sheet'!$H$77","v":122},{"$f":"$E$130*$D$130","v":122},67.58,{"$f":"$G$130*2.54","v":171.6532},{"$f":"$F$130*$H$130","v":20941.690399999999},{"$f":"$F$130/Material!$B$16","v":100.82644628099173},{"$f":"$J$130*$D$130","v":100.82644628099173},{"$f":"$G$130","v":67.58},{"$f":"$L$130*2.54","v":171.6532},{"$f":"$K$130*$M$130","v":17307.18214876033},0,{"$f":"$O$130*2.54","v":0},{"$f":"$F$130*$P$130","v":0},{"$f":"$K$130*$P$130","v":0}]
[{"$f":"'Weight sheet'!$B$78","v":"(2x) 1/4-20 x 2\" FHMS, rudder to rudder shoe"},{"$f":"'Weight sheet'!$C$78","v":4199237},{"$f":"'Weight sheet'!$D$78","v":55487},{"$f":"'Weight sheet'!$F$78","v":1},{"$f":"'Weight sheet'!$H$78","v":20.5},{"$f":"$E$131*$D$131","v":20.5},67.75,{"$f":"$G$131*2.54","v":172.08500000000001},{"$f":"$F$131*$H$131","v":3527.7425000000003},{"$f":"$E$131/SS_Density","v":2.5538806527968112},{"$f":"$J$131*$D$131","v":2.5538806527968112},{"$f":"$G$131","v":67.75},{"$f":"$L$131*2.54","v":172.08500000000001},{"$f":"$K$131*$M$131","v":439.48455213653926},0,{"$f":"$O$131*2.54","v":0},{"$f":"$F$131*$P$131","v":0},{"$f":"$K$131*$P$131","v":0}]
[{"$f":"'Weight sheet'!$B$79","v":"Top panel"},{"$f":"'Weight sheet'!$C$79","v":4199496},{"$f":"'Weight sheet'!$D$79","v":57651},{"$f":"'Weight sheet'!$F$79","v":1},{"$f":"'Weight sheet'!$H$79","v":221},{"$f":"$E$132*$D$132","v":221},54.3,{"$f":"$G$132*2.54","v":137.922},{"$f":"$F$132*$H$132","v":30480.761999999999},{"$f":"$E$132/Material!$B$16","v":182.64462809917356},{"$f":"$J$132*$D$132","v":182.64462809917356},{"$f":"$G$132","v":54.3},{"$f":"$L$132*2.54","v":137.922},{"$f":"$K$132*$M$132","v":25190.712396694216},1.65,{"$f":"$O$132*2.54","v":4.1909999999999998},{"$f":"$F$132*$P$132","v":926.21100000000001},{"$f":"$K$132*$P$132","v":765.4636363636364}]
[{"$f":"'Weight sheet'!$B$80","v":"Top panel (Bump Out)"},{"$f":"'Weight sheet'!$C$80","v":"?"},{"$f":"'Weight sheet'!$D$80","v":"?"},{"$f":"'Weight sheet'!$F$80","v":0},{"$f":"'Weight sheet'!$H$80","v":0},{"$f":"$E$133*$D$133","v":0},54.3,{"$f":"$G$133*2.54","v":137.922},{"$f":"$F$133*$H$133","v":0},232.4,{"$f":"$J$133*$D$133","v":0},{"$f":"$G$133","v":54.3},{"$f":"$L$133*2.54","v":137.922},{"$f":"$K$133*$M$133","v":0},1.65,{"$f":"$O$133*2.54","v":4.1909999999999998},{"$f":"$F$133*$P$133","v":0},{"$f":"$K$133*$P$133","v":0}]
[{"$f":"'Weight sheet'!$B$81","v":"Bottom panel"},{"$f":"'Weight sheet'!$C$81","v":4199496},{"$f":"'Weight sheet'!$D$81","v":57651},{"$f":"'Weight sheet'!$F$81","v":1},{"$f":"'Weight sheet'!$H$81","v":200},{"$f":"$E$134*$D$134","v":200},54.3,{"$f":"$G$134*2.54","v":137.922},{"$f":"$F$134*$H$134","v":27584.399999999998},{"$f":"$E$134/Material!$B$16","v":165.28925619834712},{"$f":"$J$134*$D$134","v":165.28925619834712},{"$f":"$G$134","v":54.3},{"$f":"$L$134*2.54","v":137.922},{"$f":"$K$134*$M$134","v":22797.024793388431},-1.65,{"$f":"$O$134*2.54","v":-4.1909999999999998},{"$f":"$F$134*$P$134","v":-838.19999999999993},{"$f":"$K$134*$P$134","v":-692.72727272727275}]
[{"$f":"'Weight sheet'!$B$82","v":"Bottom panel (Bump Out)"},{"$f":"'Weight sheet'!$C$82","v":"?"},{"$f":"'Weight sheet'!$D$82","v":"?"},{"$f":"'Weight sheet'!$F$82","v":0},{"$f":"'Weight sheet'!$H$82","v":0},{"$f":"$E$135*$D$135","v":0},0,{"$f":"$G$135*2.54","v":0},{"$f":"$F$135*$H$135","v":0},{"$f":"$E$135/Material!$B$16","v":0},{"$f":"$J$135*$D$135","v":0},{"$f":"$G$135","v":0},{"$f":"$L$135*2.54","v":0},{"$f":"$K$135*$M$135","v":0},0,{"$f":"$O$135*2.54","v":0},{"$f":"$F$135*$P$135","v":0},{"$f":"$K$135*$P$135","v":0}]
[{"$f":"'Weight sheet'!$B$83","v":"Panel screws - (18) FHMS 6-32 x .375 "},{"$f":"'Weight sheet'!$C$83","v":4205790},{"$f":"'Weight sheet'!$D$83","v":57671},{"$f":"'Weight sheet'!$F$83","v":1},{"$f":"'Weight sheet'!$H$83","v":17.399999999999999},{"$f":"$E$136*$D$136","v":17.399999999999999},54.3,{"$f":"$G$136*2.54","v":137.922},{"$f":"$F$136*$H$136","v":2399.8427999999999},{"$f":"$F$136/SS_Density","v":2.1676840662763173},{"$f":"$J$136*$D$136","v":2.1676840662763173},{"$f":"$G$136","v":54.3},{"$f":"$L$136*2.54","v":137.922},{"$f":"$K$136*$M$136","v":298.9713217889622},0,{"$f":"$O$136*2.54","v":0},{"$f":"$F$136*$P$136","v":0},{"$f":"$K$136*$P$136","v":0}]
[]
[{"$f":"'Weight sheet'!$B$85","v":"Assy., Ojive Aft Fairing"},{"$f":"'Weight sheet'!$C$85","v":4199434},{"$f":"'Weight sheet'!$D$85","v":55497}]
[null,"Subtotal Weight",{"$f":"IF('Weight sheet'!$F$88=1,(SUM($F$141:$F$208,$F$221:$F$262)),0)","v":0},"gm","diff"]
[null,"Scale Weight",{"$f":"'Weight sheet'!$H$87","v":0},"gm",{"$f":"$C$140-$C$139","v":0}]
[{"$f":"'Weight sheet'!$B$89","v":"Aft Fairing (Ogive)"},{"$f":"'Weight sheet'!$C$89","v":"??"},{"$f":"'Weight sheet'!$D$89","v":"??"},{"$f":"'Weight sheet'!$F$89","v":0},{"$f":"'Weight sheet'!$H$89","v":0},{"$f":"$E$141*$D$141","v":0},62.24,{"$f":"$G$141*2.54","v":158.08960000000002},{"$f":"$F$141*$H$141","v":0},{"$f":"$F$141/Fiberglass_Density","v":0},{"$f":"$J$141*$D$141","v":0},{"$f":"$G$141","v":62.24},{"$f":"$L$141*2.54","v":158.08960000000002},{"$f":"$K$141*$M$141","v":0},-8.0000000000000002E-3,{"$f":"$O$141*2.54","v":-2.0320000000000001E-2},{"$f":"$F$141*$P$141","v":0},{"$f":"$K$141*$P$141","v":0}]
[{"$f":"'Weight sheet'!$B$90","v":"Joint Ring, Aft to Forward Fairing (bonded to Aft fairing before paint)"},{"$f":"'Weight sheet'!$C$90","v":"??"},{"$f":"'Weight sheet'!$D$90","v":"??"},{"$f":"'Weight sheet'!$F$90","v":0},{"$f":"'Weight sheet'!$H$90","v":0},{"$f":"$E$142*$D$142","v":0},48.73,{"$f":"$G$142*2.54","v":123.77419999999999},{"$f":"$F$142*$H$142","v":0},{"$f":"$F$142/Alum_density","v":0},{"$f":"$J$142*$D$142","v":0},{"$f":"$G$142","v":48.73},{"$f":"$L$142*2.54","v":123.77419999999999},{"$f":"$K$142*$M$142","v":0},0,{"$f":"$O$142*2.54","v":0},{"$f":"$F$142*$P$142","v":0},{"$f":"$K$142*$P$142","v":0}]
[{"$f":"'Weight sheet'!$B$91","v":"Wing, Starboard (Ogive)"},{"$f":"'Weight sheet'!$C$91","v":"??"},{"$f":"'Weight sheet'!$D$91","v":"??"},{"$f":"'Weight sheet'!$F$91","v":0},{"$f":"'Weight sheet'!$H$91","v":0},{"$f":"$E$143*$D$143","v":0},56.25,130.69999999999999,{"$f":"$F$143*$H$143","v":0},{"$f":"$D$143*641.6","v":0},{"$f":"$J$143*$D$143","v":0},{"$f":"$G$143","v":56.25},{"$f":"$H$143","v":130.69999999999999},{"$f":"$K$143*$M$143","v":0},0,{"$f":"$O$143*2.54","v":0},{"$f":"$F$143*$P$143","v":0},{"$f":"$K$143*$P$143","v":0}]
[{"$f":"'Weight sheet'!$B$92","v":"Wing, Port  (Ogive)"},{"$f":"'Weight sheet'!$C$92","v":"??"},{"$f":"'Weight sheet'!$D$92","v":"??"},{"$f":"'Weight sheet'!$F$92","v":0},{"$f":"'Weight sheet'!$H$92","v":0},{"$f":"$E$144*$D$144","v":0},56.25,130.69999999999999,{"$f":"$F$144*$H$144","v":0},{"$f":"$D$144*641.6","v":0},{"$f":"$J$144*$D$144","v":0},{"$f":"$G$144","v":56.25},{"$f":"$H$144","v":130.69999999999999},{"$f":"$K$144*$M$144","v":0},0,{"$f":"$O$144*2.54","v":0},{"$f":"$F$144*$P$144","v":0},{"$f":"$K$144*$P$144","v":0}]
[{"$f":"'Weight sheet'!$B$93","v":"(16x) 6-32 x 3/8 FHMS (WING SCREWS)"},{"$f":"'Weight sheet'!$C$93","v":4199270},{"$f":"'Weight sheet'!$D$93","v":56912},{"$f":"'Weight sheet'!$F$93","v":0},{"$f":"'Weight sheet'!$H$93","v":0},{"$f":"$E$145*$D$145","v":0},55.71,{"$f":"$G$145*2.54","v":141.5034},{"$f":"$F$145*$H$145","v":0},{"$f":"$E$145/SS_Density","v":0},{"$f":"$J$145*$D$145","v":0},{"$f":"$G$145","v":55.71},{"$f":"$L$145*2.54","v":141.5034},{"$f":"$K$145*$M$145","v":0},0,{"$f":"$O$145*2.54","v":0},{"$f":"$F$145*$P$145","v":0},{"$f":"$K$145*$P$145","v":0}]
[{"$f":"'Weight sheet'!$B$94","v":"Rudder (Ogive)"},{"$f":"'Weight sheet'!$C$94","v":"??"},{"$f":"'Weight sheet'!$D$94","v":"??"},{"$f":"'Weight sheet'!$F$94","v":0},{"$f":"'Weight sheet'!$H$94","v":0},{"$f":"$E$146*$D$146","v":0},75.5,{"$f":"$G$146*2.54","v":191.77},{"$f":"$F$146*$H$146","v":0},{"$f":"$F$146/Material!$B$16","v":0},{"$f":"$J$146*$D$146","v":0},{"$f":"$G$146","v":75.5},{"$f":"$L$146*2.54","v":191.77},{"$f":"$K$146*$M$146","v":0},0,{"$f":"$O$146*2.54","v":0},{"$f":"$F$146*$P$146","v":0},{"$f":"$K$146*$P$146","v":0}]
[{"$f":"'Weight sheet'!$B$95","v":"(2x) 1/4-20 x 2\" FHMS, rudder to rudder shoe"},{"$f":"'Weight sheet'!$C$95","v":4199237},{"$f":"'Weight sheet'!$D$95","v":55487},{"$f":"'Weight sheet'!$F$95","v":0},{"$f":"'Weight sheet'!$H$95","v":0},{"$f":"$E$147*$D$147","v":0},74.83,{"$f":"$G$147*2.54","v":190.06819999999999},{"$f":"$F$147*$H$147","v":0},{"$f":"$E$147/SS_Density","v":0},{"$f":"$J$147*$D$147","v":0},{"$f":"$G$147","v":74.83},{"$f":"$L$147*2.54","v":190.06819999999999},{"$f":"$K$147*$M$147","v":0},0,{"$f":"$O$147*2.54","v":0},{"$f":"$F$147*$P$147","v":0},{"$f":"$K$147*$P$147","v":0}]
[{"$f":"'Weight sheet'!$B$96","v":"Top panel (Ogive)"},{"$f":"'Weight sheet'!$C$96","v":"??"},{"$f":"'Weight sheet'!$D$96","v":"??"},{"$f":"'Weight sheet'!$F$96","v":0},{"$f":"'Weight sheet'!$H$96","v":0},{"$f":"$E$148*$D$148","v":0},58.62,{"$f":"$G$148*2.54","v":148.8948},{"$f":"$F$148*$H$148","v":0},{"$f":"$E$148/Material!$B$16","v":0},{"$f":"$J$148*$D$148","v":0},{"$f":"$G$148","v":58.62},{"$f":"$L$148*2.54","v":148.8948},{"$f":"$K$148*$M$148","v":0},4.9000000000000004,{"$f":"$O$148*2.54","v":12.446000000000002},{"$f":"$F$148*$P$148","v":0},{"$f":"$K$148*$P$148","v":0}]
[{"$f":"'Weight sheet'!$B$97","v":"Bottom panel (Ogive)"},{"$f":"'Weight sheet'!$C$97","v":"??"},{"$f":"'Weight sheet'!$D$97","v":"??"},{"$f":"'Weight sheet'!$F$97","v":0},{"$f":"'Weight sheet'!$H$97","v":0},{"$f":"$E$149*$D$149","v":0},58.62,{"$f":"$G$149*2.54","v":148.8948},{"$f":"$F$149*$H$149","v":0},{"$f":"$E$149/Material!$B$16","v":0},{"$f":"$J$149*$D$149","v":0},{"$f":"$G$149","v":58.62},{"$f":"$L$149*2.54","v":148.8948},{"$f":"$K$149*$M$149","v":0},-4.74,{"$f":"$O$149*2.54","v":-12.0396},{"$f":"$F$149*$P$149","v":0},{"$f":"$K$149*$P$149","v":0}]
[{"$f":"'Weight sheet'!$B$98","v":"Panel screws - (18) FHMS 6-32 x .375 "},{"$f":"'Weight sheet'!$C$98","v":4205790},{"$f":"'Weight sheet'!$D$98","v":57671},{"$f":"'Weight sheet'!$F$98","v":0},{"$f":"'Weight sheet'!$H$98","v":0},{"$f":"$E$150*$D$150","v":0},58.1,{"$f":"$G$150*2.54","v":147.57400000000001},{"$f":"$F$150*$H$150","v":0},{"$f":"$F$150/SS_Density","v":0},{"$f":"$J$150*$D$150","v":0},{"$f":"$G$150","v":58.1},{"$f":"$L$150*2.54","v":147.57400000000001},{"$f":"$K$150*$M$150","v":0},0,{"$f":"$O$150*2.54","v":0},{"$f":"$F$150*$P$150","v":0},{"$f":"$K$150*$P$150","v":0}]
[]
[{"$f":"'Weight sheet'!$B$100","v":"Assy.,  Antenna"},{"$f":"'Weight sheet'!$C$100","v":4199332},{"$f":"'Weight sheet'!$D$100","v":49841}]
[null,"Subtotal Weight",{"$f":"SUM($F$155:$F$156)","v":549},"gm","diff"]
[null,"Scale Weight",{"$f":"'Weight sheet'!$H$102","v":549},"gm",{"$f":"$C$154-$C$153","v":0}]
[{"$f":"'Weight sheet'!$B$103","v":"Antenna Assembly GPSI (Shoe, mast, antenna, clamp, heat shrink, comm cable, dummy plug, dummy plug line, zip ties)"},{"$f":"'Weight sheet'!$C$103","v":"4199393 / 4199395 / 4199089 / 4199352 /4199234 / 4199105 / 4199262 /4199266 /4199394"},{"$f":"'Weight sheet'!$D$103","v":"52336 / 52341 / 52454 / 52231 / 55474 /52481 / 56875 /56884 / 52340"},{"$f":"'Weight sheet'!$F$103","v":1},{"$f":"'Weight sheet'!$H$103","v":549},{"$f":"$E$155*$D$155","v":549},85,{"$f":"$G$155*2.54","v":215.9},{"$f":"$F$155*$H$155","v":118529.1},355.5,{"$f":"$J$155*$D$155","v":355.5},81.305000000000007,{"$f":"$L$155*2.54","v":206.51470000000003},{"$f":"$K$155*$M$155","v":73415.975850000017},0,{"$f":"$O$155*2.54","v":0},{"$f":"$F$155*$P$155","v":0},{"$f":"$K$155*$P$155","v":0}]
["Cap (DGO protector during build - do not weigh)",null,52481,0,"NA"]
[]
[{"$f":"'Weight sheet'!$B$106","v":"Assy., Aanderaa Optode Oxygen Sensor"},{"$f":"'Weight sheet'!$C$106","v":4196239},{"$f":"'Weight sheet'!$D$106","v":55481}]
[null,"Subtotal Weight",{"$f":"SUM($F$161:$F$161)","v":395},"gm","diff"]
[null,"Scale Weight",{"$f":"'Weight sheet'!$H$108","v":395},"gm",{"$f":"$C$160-$C$159","v":0}]
[{"$f":"'Weight sheet'!$B$109","v":"O2 Sensor Assy. (Aanderaa optode, mount base, SS hose clamp, (2x) 8-32 x 5/8 FHMS, (2x) 8-32 nylok)"},{"$f":"'Weight sheet'!$C$109","v":" 4199035 / 4205811 / 4199129 / 4199163 / 4199130"},{"$f":"'Weight sheet'!$D$109","v":"52220 / 56905 / 55245 / 55321 / 55246"},{"$f":"'Weight sheet'!$F$109","v":1},{"$f":"'Weight sheet'!$H$109","v":395},{"$f":"$E$161*$D$161","v":395},57.48,{"$f":"$G$161*2.54","v":145.9992},{"$f":"$F$161*$H$161","v":57669.684000000001},105.22,{"$f":"$J$161*$D$161","v":105.22},{"$f":"$G$161","v":57.48},{"$f":"$L$161*2.54","v":145.9992},{"$f":"$K$161*$M$161","v":15362.035824000001},4.5,{"$f":"$O$161*2.54","v":11.43},{"$f":"$F$161*$P$161","v":4514.8499999999995},{"$f":"$K$161*$P$161","v":1202.6646000000001}]
[]
[{"$f":"'Weight sheet'!$B$112","v":"Assy., SBE 43f Oxygen Sensor (Not Pumped)"},{"$f":"'Weight sheet'!$C$112","v":4192455},{"$f":"'Weight sheet'!$D$112","v":55482}]
[null,"Subtotal Weight",{"$f":"SUM($F$166:$F$168)","v":366.40000000000003},"gm","diff"]
[null,"Scale Weight",{"$f":"'Weight sheet'!$H$114","v":366.4},"gm",{"$f":"$C$165-$C$164","v":0}]
[{"$f":"'Weight sheet'!$B$115","v":"O2 Sensor Assy. (O2 sensor, Plenum, (2x) 6-32 x 5/8 SHCS - plenum to sensor, O2 bracket, (2x) 8-32 x 5/8 FHMS - bracket to aft fairing, (2x) SS hose clamp)"},{"$f":"'Weight sheet'!$C$115","v":"4199047 / 4199435 / 4199129 /4199489 / 4199269"},{"$f":"'Weight sheet'!$D$115","v":"52356 / 55518/ 55245 / 56906 / 56911"},{"$f":"'Weight sheet'!$F$115","v":1},{"$f":"'Weight sheet'!$H$115","v":312.60000000000002},{"$f":"$E$166*$D$166","v":312.60000000000002},56.37,{"$f":"$G$166*2.54","v":143.1798},{"$f":"$F$166*$H$166","v":44758.00548},164.7,{"$f":"$J$166*$D$166","v":164.7},{"$f":"$G$166","v":56.37},{"$f":"$L$166*2.54","v":143.1798},{"$f":"$K$166*$M$166","v":23581.713059999998},2.5,{"$f":"$O$166*2.54","v":6.35},{"$f":"$F$166*$P$166","v":1985.01},{"$f":"$K$166*$P$166","v":1045.8449999999998}]
[{"$f":"'Weight sheet'!$B$117","v":"O2 Sensor Cable Assembly"},{"$f":"'Weight sheet'!$C$117","v":4199353},{"$f":"'Weight sheet'!$D$117","v":52236},{"$f":"'Weight sheet'!$F$117","v":1},{"$f":"'Weight sheet'!$H$117","v":53.8},{"$f":"$E$167*$D$167","v":53.8},50,{"$f":"$G$167*2.54","v":127},{"$f":"$F$167*$H$167","v":6832.5999999999995},29,{"$f":"$J$167*$D$167","v":29},{"$f":"$G$167","v":50},{"$f":"$L$167*2.54","v":127},{"$f":"$K$167*$M$167","v":3683},2,{"$f":"$O$167*2.54","v":5.08},{"$f":"$F$167*$P$167","v":273.30399999999997},{"$f":"$K$167*$P$167","v":147.32}]
[{"$f":"'Weight sheet'!$B$118","v":"Plug assy, SBE 43f plenum"},{"$f":"'Weight sheet'!$C$118","v":4199435},{"$f":"'Weight sheet'!$D$118","v":55518},{"$f":"'Weight sheet'!$F$118","v":0},{"$f":"'Weight sheet'!$G$118","v":"NA"}]
[]
[{"$f":"'Weight sheet'!$B$120","v":"Assy., WET Labs Optical - FWD Hole - (Bump OUT)"},{"$f":"'Weight sheet'!$C$120","v":4192457},{"$f":"'Weight sheet'!$D$120","v":55521}]
[null,"Subtotal Weight",{"$f":"SUM($E$173)","v":0},"gm","diff"]
[null,"Scale Weight",{"$f":"'Weight sheet'!$H$122","v":241},"gm",{"$f":"$C$172-$C$171","v":241}]
[{"$f":"'Weight sheet'!$B$123","v":"Wet Labs sensor Assy. (WL Triplet sensor, Bracket (BUMP), (2x) 6-32 x .625 SHCS - sensor clamp, 6-32 x 0.375 THCS)"},{"$f":"'Weight sheet'!$C$123","v":"4199039 / 4295315 / 4199120 / 4205790"},{"$f":"'Weight sheet'!$D$123","v":0},{"$f":"'Weight sheet'!$F$123","v":0},{"$f":"'Weight sheet'!$H$123","v":0},{"$f":"$E$173*$D$173","v":0},53.024999999999999,{"$f":"$G$173*2.54","v":134.68350000000001},{"$f":"$F$173*$H$173","v":0},{"$f":"209+59.98","v":268.98},{"$f":"$J$173*$D$173","v":0},{"$f":"$G$173","v":53.024999999999999},{"$f":"$L$173*2.54","v":134.68350000000001},{"$f":"$K$173*$M$173","v":0},-1.2370000000000001,{"$f":"$O$173*2.54","v":-3.1419800000000002},{"$f":"$F$173*$P$173","v":0},{"$f":"$K$173*$P$173","v":0}]
[]
[{"$f":"'Weight sheet'!$B$126","v":"Assy., WET Labs Optical - aft hole"},{"$f":"'Weight sheet'!$C$126","v":4192457},{"$f":"'Weight sheet'!$D$126","v":55521}]
[null,"Subtotal Weight",{"$f":"SUM($E$178)","v":238.2},"gm","diff"]
[null,"Scale Weight",{"$f":"'Weight sheet'!$H$128","v":269},"gm",{"$f":"$C$177-$C$176","v":30.800000000000011}]
[{"$f":"'Weight sheet'!$B$129","v":"Wet Labs sensor Assy. (WL Triplet sensor, (2x) Wet labs sensor clamp, (2x) 8-32 x 5/8 FHMS - sensor clamp to fairing)"},{"$f":"'Weight sheet'!$C$129","v":"4199039 / 4199388 / 4199129"},{"$f":"'Weight sheet'!$D$129","v":"52296 / 52312 / 55245"},{"$f":"'Weight sheet'!$F$129","v":1},{"$f":"'Weight sheet'!$H$129","v":238.2},{"$f":"$E$178*$D$178","v":238.2},62.33,{"$f":"$G$178*2.54","v":158.31819999999999},{"$f":"$F$178*$H$178","v":37711.395239999998},178.8,{"$f":"$J$178*$D$178","v":178.8},{"$f":"$G$178","v":62.33},{"$f":"$L$178*2.54","v":158.31819999999999},{"$f":"$K$178*$M$178","v":28307.294160000001},-1.2370000000000001,{"$f":"$O$178*2.54","v":-3.1419800000000002},{"$f":"$F$178*$P$178","v":-748.41963599999997},{"$f":"$K$178*$P$178","v":-561.78602400000011}]
[{"$f":"'Weight sheet'!$B$131","v":"Cover, WL sensor used in shipping"},{"$f":"'Weight sheet'!$C$131","v":4199254},{"$f":"'Weight sheet'!$D$131","v":55520},0,"NA"]
[]
[{"$f":"'Weight sheet'!$B$133","v":"Assy., WET Labs Optical - Dual Hole Closest to PUPA"},{"$f":"'Weight sheet'!$C$133","v":4192457},{"$f":"'Weight sheet'!$D$133","v":55521}]
[null,"Subtotal Weight",{"$f":"SUM($E$184)","v":249},"gm","diff"]
[null,"Scale Weight",{"$f":"'Weight sheet'!$H$135","v":249},"gm",{"$f":"$C$183-$C$182","v":0}]
[{"$f":"'Weight sheet'!$B$136","v":"Wet Labs sensor Assy. (WL Triplet sensor, Bracket Ext mount, 6-32 x 0.625 SHCS, 2x 6-32 x 0.375in Truss Head Phillips)"},{"$f":"'Weight sheet'!$C$136","v":"4199039 / 4295315 / 4199120 / 4205790"},{"$f":"'Weight sheet'!$D$136","v":"52296 / 52312 / 55245"},{"$f":"'Weight sheet'!$F$136","v":1},{"$f":"'Weight sheet'!$H$136","v":249},{"$f":"$E$184*$D$184","v":249},60.15,{"$f":"$G$184*2.54","v":152.78100000000001},{"$f":"$F$184*$H$184","v":38042.469000000005},178.8,{"$f":"$J$184*$D$184","v":178.8},{"$f":"$G$184","v":60.15},{"$f":"$L$184*2.54","v":152.78100000000001},{"$f":"$K$184*$M$184","v":27317.242800000004},-1.2370000000000001,{"$f":"$O$184*2.54","v":-3.1419800000000002},{"$f":"$F$184*$P$184","v":-782.35302000000001},{"$f":"$K$184*$P$184","v":-561.78602400000011}]
["Cover, WL sensor used in shipping",{"$f":"'Weight sheet'!$C$138","v":4199254},{"$f":"'Weight sheet'!$D$138","v":55520},0,"NA"]
[]
[{"$f":"'Weight sheet'!$B$140","v":"Assy., SBE CTD & Pumped 43f Oxygen Sensor"},{"$f":"'Weight sheet'!$C$140","v":4295305},{"$f":"'Weight sheet'!$D$140","v":0}]
[null,"Subtotal Weight",{"$f":"SUM($F$190:$F$195)","v":0},"gm","diff"]
[null,"Scale Weight",{"$f":"'Weight sheet'!$H$142","v":0},"gm",{"$f":"$C$189-$C$188","v":0}]
[{"$f":"'Weight sheet'!$B$143","v":"GPCTD 90688.007, Bracket CTD Rear, Bracket CTD Forward, 6-32 x 0.625in SHCS, 8-32 x 0.25in Pan Head, 6-32 x 0.375in Flat Head"},{"$f":"'Weight sheet'!$C$143","v":"4272424 / 4289667 / 4289656 / 4199120 / 4233372 / 4199270"},{"$f":"'Weight sheet'!$D$143","v":"?"},{"$f":"'Weight sheet'!$F$143","v":0},{"$f":"'Weight sheet'!$H$143","v":0},{"$f":"$E$190*$D$190","v":0},{"$f":"IF($D$126-1,55.178,55.5)","v":55.5},{"$f":"$G$190*2.54","v":140.97},{"$f":"$F$190*$H$190","v":0},635,{"$f":"$J$190*$D$190","v":0},{"$f":"$G$190","v":55.5},{"$f":"$L$190*2.54","v":140.97},{"$f":"$K$190*$M$190","v":0},3.7949999999999999,{"$f":"$O$190*2.54","v":9.6393000000000004},{"$f":"$F$190*$P$190","v":0},{"$f":"$K$190*$P$190","v":0}]
[{"$f":"'Weight sheet'!$B$144","v":"GPCTD PUMP PWR Cable, GPCTD PWR/Serial Cable"},{"$f":"'Weight sheet'!$C$144","v":"4293654 / 4274285"},{"$f":"'Weight sheet'!$D$144","v":"?"},{"$f":"'Weight sheet'!$F$144","v":0},{"$f":"'Weight sheet'!$H$144","v":0},{"$f":"$E$191*$D$191","v":0},{"$f":"IF($D$126-1,55.18,57)","v":57},{"$f":"$G$191*2.54","v":144.78},{"$f":"$F$191*$H$191","v":0},130,{"$f":"$J$191*$D$191","v":0},{"$f":"$G$191","v":57},{"$f":"$L$191*2.54","v":144.78},{"$f":"$K$191*$M$191","v":0},0,{"$f":"$O$191*2.54","v":0},{"$f":"$F$191*$P$191","v":0},{"$f":"$K$191*$P$191","v":0}]
[{"$f":"'Weight sheet'!$B$145","v":"TUBING 2x 3/8in id x 1/2\" od, 2x 1/2\" id x 3/4\" od"},{"$f":"'Weight sheet'!$C$145","v":"4291710 / 4291709"},{"$f":"'Weight sheet'!$D$145","v":"?"},{"$f":"'Weight sheet'!$F$145","v":0},{"$f":"'Weight sheet'!$H$145","v":0},{"$f":"$E$192*$D$192","v":0},{"$f":"IF($D$126-1,59.46,60)","v":60},{"$f":"$G$192*2.54","v":152.4},{"$f":"$F$192*$H$192","v":0},60,{"$f":"$J$192*$D$192","v":0},{"$f":"$G$192","v":60},{"$f":"$L$192*2.54","v":152.4},{"$f":"$K$192*$M$192","v":0},0,{"$f":"$O$192*2.54","v":0},{"$f":"$F$192*$P$192","v":0},{"$f":"$K$192*$P$192","v":0}]
[{"$f":"'Weight sheet'!$B$147","v":"GPCTD 90696 Pump, Pump Bracket, 6-32 x 0.375 Flat Head, Cable Ties"},{"$f":"'Weight sheet'!$C$147","v":"4272326 / 4295332 / 4199270 / 4199110"},{"$f":"'Weight sheet'!$D$147","v":"?"},{"$f":"'Weight sheet'!$F$147","v":0},{"$f":"'Weight sheet'!$H$147","v":0},{"$f":"$E$193*$D$193","v":0},64.3,{"$f":"$G$193*2.54","v":163.322},{"$f":"$F$193*$H$193","v":0},286,{"$f":"$J$193*$D$193","v":0},{"$f":"$G$193","v":64.3},{"$f":"$L$193*2.54","v":163.322},{"$f":"$K$193*$M$193","v":0},0,{"$f":"$O$193*2.54","v":0},{"$f":"$F$193*$P$193","v":0},{"$f":"$K$193*$P$193","v":0}]
[{"$f":"'Weight sheet'!$B$149","v":"O2 Sensor"},{"$f":"'Weight sheet'!$C$149","v":0},{"$f":"'Weight sheet'!$D$149","v":0},{"$f":"'Weight sheet'!$F$149","v":0},{"$f":"'Weight sheet'!$H$149","v":0},{"$f":"$E$194*$D$194","v":0},59.5,{"$f":"$G$194*2.54","v":151.13},{"$f":"$F$194*$H$194","v":0},336,{"$f":"$J$194*$D$194","v":0},{"$f":"$G$194","v":59.5},{"$f":"$L$194*2.54","v":151.13},{"$f":"$K$194*$M$194","v":0},0,{"$f":"$O$194*2.54","v":0},{"$f":"$F$194*$P$194","v":0},{"$f":"$K$194*$P$194","v":0}]
[{"$f":"'Weight sheet'!$B$150","v":"O2 Sensor Cable Assembly"},{"$f":"'Weight sheet'!$C$150","v":4293655},{"$f":"'Weight sheet'!$D$150","v":0},{"$f":"'Weight sheet'!$F$150","v":0},{"$f":"'Weight sheet'!$H$150","v":0},{"$f":"$E$195*$D$195","v":0},{"$f":"IF($D$126-1,50,50)","v":50},{"$f":"$G$195*2.54","v":127},{"$f":"$F$195*$H$195","v":0},75,{"$f":"$J$195*$D$195","v":0},{"$f":"$G$195","v":50},{"$f":"$L$195*2.54","v":127},{"$f":"$K$195*$M$195","v":0},0,{"$f":"$O$195*2.54","v":0},{"$f":"$F$195*$P$195","v":0},{"$f":"$K$195*$P$195","v":0}]
[]
[{"$f":"'Weight sheet'!$B$153","v":"Assy., Argos Mount"},{"$f":"'Weight sheet'!$C$153","v":"?"},{"$f":"'Weight sheet'!$D$153","v":"?"}]
[null,"Subtotal Weight",{"$f":"SUM($F$200:$F$201)","v":52.5},"gm","diff"]
[null,"Scale Weight",{"$f":"'Weight sheet'!$H$155","v":52.5},"gm",{"$f":"$C$199-$C$198","v":0}]
[{"$f":"'Weight sheet'!$B$156","v":"Argos Tag"},{"$f":"'Weight sheet'!$C$156","v":"?"},{"$f":"'Weight sheet'!$D$156","v":"?"},{"$f":"'Weight sheet'!$F$156","v":1},{"$f":"'Weight sheet'!$H$156","v":52.5},{"$f":"$E$200*$D$200","v":52.5},67.58,{"$f":"$G$200*2.54","v":171.6532},{"$f":"$F$200*$H$200","v":9011.7929999999997},34.200000000000003,{"$f":"$J$200*$D$200","v":34.200000000000003},{"$f":"$G$200","v":67.58},{"$f":"$L$200*2.54","v":171.6532},{"$f":"$K$200*$M$200","v":5870.5394400000005},0.75,{"$f":"$O$200*2.54","v":1.905},{"$f":"$F$200*$P$200","v":100.0125},{"$f":"$K$200*$P$200","v":65.15100000000001}]
[{"$f":"'Weight sheet'!$B$158","v":"Argos Mount Hardware. (?) - Clamp to Antenna, 4 screws, 2 brackets"},{"$f":"'Weight sheet'!$C$158","v":"2601, 4258110 "},{"$f":"'Weight sheet'!$D$158","v":"?"},{"$f":"'Weight sheet'!$F$158","v":0},{"$f":"'Weight sheet'!$H$158","v":0},{"$f":"$E$201*$D$201","v":0},67.58,{"$f":"$G$201*2.54","v":171.6532},{"$f":"$F$201*$H$201","v":0},8.3000000000000007,{"$f":"$J$201*$D$201","v":0},{"$f":"$G$201","v":67.58},{"$f":"$L$201*2.54","v":171.6532},{"$f":"$K$201*$M$201","v":0},0.15,{"$f":"$O$201*2.54","v":0.38100000000000001},{"$f":"$F$201*$P$201","v":0},{"$f":"$K$201*$P$201","v":0}]
[]
[{"$f":"'Weight sheet'!$B$161","v":"Assy., PAR, BSI - QSP2000"},{"$f":"'Weight sheet'!$C$161","v":"?"},{"$f":"'Weight sheet'!$D$161","v":"?"}]
[null,"Subtotal Weight",{"$f":"SUM($F$206:$F$208)","v":0},"gm","diff"]
[null,"Scale Weight",{"$f":"'Weight sheet'!$H$163","v":0},"gm",{"$f":"$C$205-$C$204","v":0}]
[{"$f":"'Weight sheet'!$B$164","v":"SENSOR, PAR BSI - QSP-200 SERIES + SHIELD, LIGHT- PAR BSI + (1x) SCREW, FLAT HEAD- PHILLIPS, #6-32 X .375, SS"},{"$f":"'Weight sheet'!$C$164","v":"?"},{"$f":"'Weight sheet'!$D$164","v":"?"},{"$f":"'Weight sheet'!$F$164","v":0},{"$f":"'Weight sheet'!$H$164","v":0},{"$f":"$E$206*$D$206","v":0},60.05,{"$f":"$G$206*2.54","v":152.52699999999999},{"$f":"$F$206*$H$206","v":0},320,{"$f":"$J$206*$D$206","v":0},{"$f":"$G$206","v":60.05},{"$f":"$L$206*2.54","v":152.52699999999999},{"$f":"$K$206*$M$206","v":0},2,{"$f":"$O$206*2.54","v":5.08},{"$f":"$F$206*$P$206","v":0},{"$f":"$K$206*$P$206","v":0}]
[{"$f":"'Weight sheet'!$B$166","v":"BRACKET, PAR QSP 2000, INTERNAL + SCREW, (2x) TRUSS HEAD - PHILLIPS, #6-32 X .375, SS + CLAMP, HOSE - WORM DRIVE 2.0IN TO 3.0IN, SS"},{"$f":"'Weight sheet'!$C$166","v":"?"},{"$f":"'Weight sheet'!$D$166","v":"?"},{"$f":"'Weight sheet'!$F$166","v":0},{"$f":"'Weight sheet'!$H$166","v":0},{"$f":"$E$207*$D$207","v":0},62.1,{"$f":"$G$207*2.54","v":157.73400000000001},{"$f":"$F$207*$H$207","v":0},26,{"$f":"$J$207*$D$207","v":0},{"$f":"$G$207","v":62.1},{"$f":"$L$207*2.54","v":157.73400000000001},{"$f":"$K$207*$M$207","v":0},1,{"$f":"$O$207*2.54","v":2.54},{"$f":"$F$207*$P$207","v":0},{"$f":"$K$207*$P$207","v":0}]
[{"$f":"'Weight sheet'!$B$167","v":"ASSY, CABLE - PAR SENSOR INTERFACE"},{"$f":"'Weight sheet'!$C$167","v":"?"},{"$f":"'Weight sheet'!$D$167","v":"?"},{"$f":"'Weight sheet'!$F$167","v":0},{"$f":"'Weight sheet'!$H$167","v":0},{"$f":"$E$208*$D$208","v":0},55,{"$f":"$G$208*2.54","v":139.69999999999999},{"$f":"$F$208*$H$208","v":0},3.5,{"$f":"$J$208*$D$208","v":0},{"$f":"$G$208","v":55},{"$f":"$L$208*2.54","v":139.69999999999999},{"$f":"$K$208*$M$208","v":0},0,{"$f":"$O$208*2.54","v":0},{"$f":"$F$208*$P$208","v":0},{"$f":"$K$208*$P$208","v":0}]
[]
[{"$f":"'Weight sheet'!$B$169","v":"Assy., Radiation Detector"},{"$f":"'Weight sheet'!$C$169","v":4314372},{"$f":"'Weight sheet'!$D$169","v":"?"}]
[null,"Subtotal Weight",{"$f":"SUM($F$213:$F$215)","v":0},"gm","diff"]
[null,"Scale Weight",{"$f":"'Weight sheet'!$H$171","v":0},"gm",{"$f":"$C$212-$C$211","v":0}]
[{"$f":"'Weight sheet'!$B$172","v":"SENSOR, RADIATION DETECTOR"},{"$f":"'Weight sheet'!$C$172","v":4314373},{"$f":"'Weight sheet'!$D$172","v":"?"},{"$f":"'Weight sheet'!$F$172","v":0},{"$f":"'Weight sheet'!$H$172","v":0},{"$f":"$E$213*$D$213","v":0},-1.88,{"$f":"$G$213*2.54","v":-4.7751999999999999},{"$f":"$F$213*$H$213","v":0},2886.8270000000002,{"$f":"$J$213*$D$213","v":0},{"$f":"$G$213","v":-1.88},{"$f":"$L$213*2.54","v":-4.7751999999999999},{"$f":"$K$213*$M$213","v":0},0,{"$f":"$O$213*2.54","v":0},{"$f":"$F$213*$P$213","v":0},{"$f":"$K$213*$P$213","v":0}]
[{"$f":"'Weight sheet'!$B$174","v":"BRACKET, SENSOR, RADIATION DETECTOR / BRACKET, FAIRING SUPPORT, RADIATION DETECTOR / (6x) SCREW, FLAT HEAD - PHILLIPS, #8-32X .625IN SS"},{"$f":"'Weight sheet'!$C$174","v":"4318407 / 4334120 / 4199129"},{"$f":"'Weight sheet'!$D$174","v":"?"},{"$f":"'Weight sheet'!$F$174","v":0},{"$f":"'Weight sheet'!$H$174","v":0},{"$f":"$E$214*$D$214","v":0},7.7510000000000003,{"$f":"$G$214*2.54","v":19.687540000000002},{"$f":"$F$214*$H$214","v":0},262.52,{"$f":"$J$214*$D$214","v":0},{"$f":"$G$214","v":7.7510000000000003},{"$f":"$L$214*2.54","v":19.687540000000002},{"$f":"$K$214*$M$214","v":0},0,{"$f":"$O$214*2.54","v":0},{"$f":"$F$214*$P$214","v":0},{"$f":"$K$214*$P$214","v":0}]
[{"$f":"'Weight sheet'!$B$175","v":"FAIRING, SENSOR, RADIATION DETECTOR /  (6x) SCREW, BUTTON HEAD - ALLEN, #10-32 X 1.5IN SS"},{"$f":"'Weight sheet'!$C$175","v":"4318408 / 4254832"},{"$f":"'Weight sheet'!$D$175","v":"?"},{"$f":"'Weight sheet'!$F$175","v":0},{"$f":"'Weight sheet'!$H$175","v":0},{"$f":"$E$215*$D$215","v":0},4.2759999999999998,{"$f":"$G$215*2.54","v":10.861039999999999},{"$f":"$F$215*$H$215","v":0},167.31,{"$f":"$J$215*$D$215","v":0},{"$f":"$G$215","v":4.2759999999999998},{"$f":"$L$215*2.54","v":10.861039999999999},{"$f":"$K$215*$M$215","v":0},0,{"$f":"$O$215*2.54","v":0},{"$f":"$F$215*$P$215","v":0},{"$f":"$K$215*$P$215","v":0}]
[{"$f":"'Weight sheet'!$B$176","v":"ASSY, CABLE - RADIATION DETECTOR / 1.5IN WIDE ELECTRICAL TAPE"},{"$f":"'Weight sheet'!$C$176","v":"4326393 / ??????"},{"$f":"'Weight sheet'!$D$176","v":0},{"$f":"'Weight sheet'!$F$176","v":0},{"$f":"'Weight sheet'!$H$176","v":0},{"$f":"$E$216*$D$216","v":0},30.693000000000001,{"$f":"$G$216*2.54","v":77.960220000000007},{"$f":"$F$216*$H$216","v":0},64.991,{"$f":"$J$216*$D$216","v":0},{"$f":"$G$216","v":30.693000000000001},{"$f":"$L$216*2.54","v":77.960220000000007},{"$f":"$K$216*$M$216","v":0},5,{"$f":"$O$216*2.54","v":12.7},{"$f":"$F$216*$P$216","v":0},{"$f":"$K$216*$P$216","v":0}]
[]
[{"$f":"'Weight sheet'!$B$178","v":"Assy, Nortek ADCP"},{"$f":"'Weight sheet'!$C$178","v":4314562},{"$f":"'Weight sheet'!$D$178","v":"?"}]
[null,"Subtotal Weight",{"$f":"SUM($F$221:$F$222)","v":0},"gm","diff"]
[null,"Scale Weight",{"$f":"'Weight sheet'!$H$180","v":0},"gm",{"$f":"$C$220-$C$219","v":0}]
[{"$f":"'Weight sheet'!$B$181","v":"SENSOR, ACOUSTIC DOPPLER CURRENT PROFILER, NORTEK / BRACKET, SENSOR - ADCP / (4x) SCREW, SHCS, 10-32 X .500, SS / (3x) #6-32 X .375 TRUSS HEAD, SS"},{"$f":"'Weight sheet'!$C$181","v":"4314562 / 4328749 / 2539 / ????"},{"$f":"'Weight sheet'!$D$181","v":"?"},{"$f":"'Weight sheet'!$F$181","v":0},{"$f":"'Weight sheet'!$H$181","v":0},{"$f":"$E$221*$D$221","v":0},54.63,{"$f":"$G$221*2.54","v":138.7602},{"$f":"$F$221*$H$221","v":0},1307.9000000000001,{"$f":"$J$221*$D$221","v":0},{"$f":"$G$221","v":54.63},{"$f":"$L$221*2.54","v":138.7602},{"$f":"$K$221*$M$221","v":0},-5.33,{"$f":"$O$221*2.54","v":-13.5382},{"$f":"$F$221*$P$221","v":0},{"$f":"$K$221*$P$221","v":0}]
[{"$f":"'Weight sheet'!$B$183","v":"SENSOR, CABLE"},{"$f":"'Weight sheet'!$C$183","v":"?????"},{"$f":"'Weight sheet'!$D$183","v":"?"},{"$f":"'Weight sheet'!$F$183","v":0},{"$f":"'Weight sheet'!$H$183","v":0},{"$f":"$E$222*$D$222","v":0},54,{"$f":"$G$222*2.54","v":137.16},{"$f":"$F$222*$H$222","v":0},51.5,{"$f":"$J$222*$D$222","v":0},{"$f":"$G$222","v":54},{"$f":"$L$222*2.54","v":137.16},{"$f":"$K$222*$M$222","v":0},0,{"$f":"$O$222*2.54","v":0},{"$f":"$F$222*$P$222","v":0},{"$f":"$K$222*$P$222","v":0}]
[]
[{"$f":"'Weight sheet'!$B$185","v":"Assy, Imagenex ECHOSounder"},{"$f":"'Weight sheet'!$C$185","v":4321091},{"$f":"'Weight sheet'!$D$185","v":"?"}]
[null,"Subtotal Weight",{"$f":"SUM($F$227:$F$229)","v":0},"gm","diff"]
[null,"Scale Weight",{"$f":"'Weight sheet'!$H$187","v":0},"gm",{"$f":"$C$226-$C$225","v":0}]
[{"$f":"'Weight sheet'!$B$188","v":"SENSOR, ECHOSOUNDER 853, IMAGENEX / BRACKET, SENSOR, BASE - ECHOSOUNDER / BRACKET, SENSOR, STANDOFF - ECHOSOUNDER / (2x) SCREW #8-32 X .500, SS /  (3x) SCREW TRUSS HEAD #6-32 X .375, SS / (4x) SCREW #8-32 X .25 TRUSS HEAD"},{"$f":"'Weight sheet'!$C$188","v":"4321091 / 4328900 / 4329102 "},{"$f":"'Weight sheet'!$D$188","v":"?"},{"$f":"'Weight sheet'!$F$188","v":0},{"$f":"'Weight sheet'!$H$188","v":0},{"$f":"$E$227*$D$227","v":0},61.93,{"$f":"$G$227*2.54","v":157.3022},{"$f":"$F$227*$H$227","v":0},516.20000000000005,{"$f":"$J$227*$D$227","v":0},{"$f":"$G$227","v":61.93},{"$f":"$L$227*2.54","v":157.3022},{"$f":"$K$227*$M$227","v":0},0,{"$f":"$O$227*2.54","v":0},{"$f":"$F$227*$P$227","v":0},{"$f":"$K$227*$P$227","v":0}]
[{"$f":"'Weight sheet'!$B$190","v":"SENSOR CABLE"},{"$f":"'Weight sheet'!$C$190","v":"-"},{"$f":"'Weight sheet'!$D$190","v":"?"},{"$f":"'Weight sheet'!$F$190","v":0},{"$f":"'Weight sheet'!$H$190","v":0},{"$f":"$E$228*$D$228","v":0},58,{"$f":"$G$228*2.54","v":147.32},{"$f":"$F$228*$H$228","v":0},57,{"$f":"$J$228*$D$228","v":0},{"$f":"$G$228","v":58},{"$f":"$L$228*2.54","v":147.32},{"$f":"$K$228*$M$228","v":0},0,{"$f":"$O$228*2.54","v":0},{"$f":"$F$228*$P$228","v":0},{"$f":"$K$228*$P$228","v":0}]
[{"$f":"'Weight sheet'!$B$191","v":"New Sensor Cable"},{"$f":"'Weight sheet'!$C$191","v":"?"},{"$f":"'Weight sheet'!$D$191","v":"?"},{"$f":"'Weight sheet'!$F$191","v":0},{"$f":"'Weight sheet'!$H$191","v":0},{"$f":"$E$229*$D$229","v":0},0,{"$f":"$G$229*2.54","v":0},{"$f":"$F$229*$H$229","v":0},0,{"$f":"$J$229*$D$229","v":0},{"$f":"$G$229","v":0},{"$f":"$L$229*2.54","v":0},{"$f":"$K$229*$M$229","v":0},0,{"$f":"$O$229*2.54","v":0},{"$f":"$F$229*$P$229","v":0},{"$f":"$K$229*$P$229","v":0}]
[]
[{"$f":"'Weight sheet'!$B$193","v":"Assy, RAFOS"},{"$f":"'Weight sheet'!$C$191","v":"?"},{"$f":"'Weight sheet'!$D$191","v":"?"}]
[null,"Subtotal Weight",{"$f":"SUM($F$234:$F$236)","v":0},"gm","diff"]
[null,"Scale Weight",{"$f":"'Weight sheet'!$H$193","v":0},"gm",{"$f":"$C$233-$C$232","v":0}]
[{"$f":"'Weight sheet'!$B$196","v":"Hydrophone for RAFOS system - added by UW-SFC"},{"$f":"'Weight sheet'!$C$196","v":"?"},{"$f":"'Weight sheet'!$D$196","v":"?"},{"$f":"'Weight sheet'!$F$196","v":0},{"$f":"'Weight sheet'!$H$196","v":0},{"$f":"$E$234*$D$234","v":0},63.3,{"$f":"$G$234*2.54","v":160.78199999999998},{"$f":"$F$234*$H$234","v":0},70,{"$f":"$J$234*$D$234","v":0},{"$f":"$G$234","v":63.3},{"$f":"$L$234*2.54","v":160.78199999999998},{"$f":"$K$234*$M$234","v":0},1.5,{"$f":"$O$234*2.54","v":3.81},{"$f":"$F$234*$P$234","v":0},{"$f":"$K$234*$P$234","v":0}]
[{"$f":"'Weight sheet'!$B$198","v":"RAFOS Mount Hardware. (?) "},{"$f":"'Weight sheet'!$C$198","v":"?"},{"$f":"'Weight sheet'!$D$198","v":"?"},{"$f":"'Weight sheet'!$F$198","v":0},{"$f":"'Weight sheet'!$H$198","v":0},{"$f":"$E$235*$D$235","v":0},0,{"$f":"$G$235*2.54","v":0},{"$f":"$F$235*$H$235","v":0},0,{"$f":"$J$235*$D$235","v":0},{"$f":"$G$235","v":0},{"$f":"$L$235*2.54","v":0},{"$f":"$K$235*$M$235","v":0},0,{"$f":"$O$235*2.54","v":0},{"$f":"$F$235*$P$235","v":0},{"$f":"$K$235*$P$235","v":0}]
[{"$f":"'Weight sheet'!$B$199","v":"RAFOS Cable"},{"$f":"'Weight sheet'!$C$199","v":"?"},{"$f":"'Weight sheet'!$D$199","v":"?"},{"$f":"'Weight sheet'!$F$199","v":0},{"$f":"'Weight sheet'!$H$199","v":0},{"$f":"$E$236*$D$236","v":0},0,{"$f":"$G$236*2.54","v":0},{"$f":"$F$236*$H$236","v":0},0,{"$f":"$J$236*$D$236","v":0},{"$f":"$G$236","v":0},{"$f":"$L$236*2.54","v":0},{"$f":"$K$236*$M$236","v":0},0,{"$f":"$O$236*2.54","v":0},{"$f":"$F$236*$P$236","v":0},{"$f":"$K$236*$P$236","v":0}]
[]
[{"$f":"'Weight sheet'!$B$201","v":"Assy, New Sensor #1"},{"$f":"'Weight sheet'!$C$199","v":"?"},{"$f":"'Weight sheet'!$D$199","v":"?"}]
[null,"Subtotal Weight",{"$f":"SUM($F$241:$F$243)","v":0},"gm","diff"]
[null,"Scale Weight",{"$f":"'Weight sheet'!$H$201","v":0},"gm",{"$f":"$C$240-$C$239","v":0}]
[{"$f":"'Weight sheet'!$B$204","v":"New Sensor #1"},{"$f":"'Weight sheet'!$C$204","v":"?"},{"$f":"'Weight sheet'!$D$204","v":"?"},{"$f":"'Weight sheet'!$F$204","v":0},{"$f":"'Weight sheet'!$H$204","v":0},{"$f":"$E$241*$D$241","v":0},0,{"$f":"$G$241*2.54","v":0},{"$f":"$F$241*$H$241","v":0},0,{"$f":"$J$241*$D$241","v":0},{"$f":"$G$241","v":0},{"$f":"$L$241*2.54","v":0},{"$f":"$K$241*$M$241","v":0},0,{"$f":"$O$241*2.54","v":0},{"$f":"$F$241*$P$241","v":0},{"$f":"$K$241*$P$241","v":0}]
[{"$f":"'Weight sheet'!$B$206","v":"New Sensor #1 Mount Hardware. (?) "},{"$f":"'Weight sheet'!$C$206","v":"?"},{"$f":"'Weight sheet'!$D$206","v":"?"},{"$f":"'Weight sheet'!$F$206","v":0},{"$f":"'Weight sheet'!$H$206","v":0},{"$f":"$E$242*$D$242","v":0},0,{"$f":"$G$242*2.54","v":0},{"$f":"$F$242*$H$242","v":0},0,{"$f":"$J$242*$D$242","v":0},{"$f":"$G$242","v":0},{"$f":"$L$242*2.54","v":0},{"$f":"$K$242*$M$242","v":0},0,{"$f":"$O$242*2.54","v":0},{"$f":"$F$242*$P$242","v":0},{"$f":"$K$242*$P$242","v":0}]
[{"$f":"'Weight sheet'!$B$207","v":"New Sensor #1 Cable"},{"$f":"'Weight sheet'!$C$207","v":"?"},{"$f":"'Weight sheet'!$D$207","v":"?"},{"$f":"'Weight sheet'!$F$207","v":0},{"$f":"'Weight sheet'!$H$207","v":0},{"$f":"$E$243*$D$243","v":0},0,{"$f":"$G$243*2.54","v":0},{"$f":"$F$243*$H$243","v":0},0,{"$f":"$J$243*$D$243","v":0},{"$f":"$G$243","v":0},{"$f":"$L$243*2.54","v":0},{"$f":"$K$243*$M$243","v":0},0,{"$f":"$O$243*2.54","v":0},{"$f":"$F$243*$P$243","v":0},{"$f":"$K$243*$P$243","v":0}]
[]
[{"$f":"'Weight sheet'!$B$209","v":"Assy, New Sensor #2"},{"$f":"'Weight sheet'!$C$207","v":"?"},{"$f":"'Weight sheet'!$D$207","v":"?"}]
[null,"Subtotal Weight",{"$f":"SUM($F$248:$F$250)","v":0},"gm","diff"]
[null,"Scale Weight",{"$f":"'Weight sheet'!$H$209","v":0},"gm",{"$f":"$C$247-$C$246","v":0}]
[{"$f":"'Weight sheet'!$B$212","v":"New Sensor #2"},{"$f":"'Weight sheet'!$C$212","v":"?"},{"$f":"'Weight sheet'!$D$212","v":"?"},{"$f":"'Weight sheet'!$F$212","v":0},{"$f":"'Weight sheet'!$H$212","v":0},{"$f":"$E$248*$D$248","v":0},0,{"$f":"$G$248*2.54","v":0},{"$f":"$F$248*$H$248","v":0},0,{"$f":"$J$248*$D$248","v":0},{"$f":"$G$248","v":0},{"$f":"$L$248*2.54","v":0},{"$f":"$K$248*$M$248","v":0},0,{"$f":"$O$248*2.54","v":0},{"$f":"$F$248*$P$248","v":0},{"$f":"$K$248*$P$248","v":0}]
[{"$f":"'Weight sheet'!$B$214","v":"New Sensor #2 Mount Hardware. (?) "},{"$f":"'Weight sheet'!$C$214","v":"?"},{"$f":"'Weight sheet'!$D$214","v":"?"},{"$f":"'Weight sheet'!$F$214","v":0},{"$f":"'Weight sheet'!$H$214","v":0},{"$f":"$E$249*$D$249","v":0},0,{"$f":"$G$249*2.54","v":0},{"$f":"$F$249*$H$249","v":0},0,{"$f":"$J$249*$D$249","v":0},{"$f":"$G$249","v":0},{"$f":"$L$249*2.54","v":0},{"$f":"$K$249*$M$249","v":0},0,{"$f":"$O$249*2.54","v":0},{"$f":"$F$249*$P$249","v":0},{"$f":"$K$249*$P$249","v":0}]
[{"$f":"'Weight sheet'!$B$215","v":"New Sensor #2 Cable"},{"$f":"'Weight sheet'!$C$215","v":"?"},{"$f":"'Weight sheet'!$D$215","v":"?"},{"$f":"'Weight sheet'!$F$215","v":0},{"$f":"'Weight sheet'!$H$215","v":0},{"$f":"$E$250*$D$250","v":0},0,{"$f":"$G$250*2.54","v":0},{"$f":"$F$250*$H$250","v":0},0,{"$f":"$J$250*$D$250","v":0},{"$f":"$G$250","v":0},{"$f":"$L$250*2.54","v":0},{"$f":"$K$250*$M$250","v":0},0,{"$f":"$O$250*2.54","v":0},{"$f":"$F$250*$P$250","v":0},{"$f":"$K$250*$P$250","v":0}]
[]
[{"$f":"'Weight sheet'!$B$217","v":"Assy, AFT Foam Block Ballast"},{"$f":"'Weight sheet'!$C$208","v":0},{"$f":"'Weight sheet'!$D$208","v":0}]
[null,"Subtotal Weight",{"$f":"SUM($F$255:$F$257)","v":0},"gm","diff"]
[null,"Scale Weight",{"$f":"'Weight sheet'!$H$217","v":0},"gm",{"$f":"$C$254-$C$253","v":0}]
[{"$f":"'Weight sheet'!$B$220","v":"Foam Block location \"under Ogive Top hatch cover\""},{"$f":"'Weight sheet'!$C$220","v":"?"},{"$f":"'Weight sheet'!$D$220","v":"?"},{"$f":"'Weight sheet'!$F$220","v":0},{"$f":"'Weight sheet'!$H$220","v":0},{"$f":"$E$255*$D$255","v":0},58.25,{"$f":"$G$255*2.54","v":147.95500000000001},{"$f":"$F$255*$H$255","v":0},{"$f":"$F$255/syntactic_foam_density","v":0},{"$f":"$J$255*$D$255","v":0},{"$f":"$G$255","v":58.25},{"$f":"$L$255*2.54","v":147.95500000000001},{"$f":"$K$255*$M$255","v":0},4.0199999999999996,{"$f":"$O$255*2.54","v":10.210799999999999},{"$f":"$F$255*$P$255","v":0},{"$f":"$K$255*$P$255","v":0}]
[{"$f":"'Weight sheet'!$B$221","v":"Hardware for Foam Block location \"under Ogive Top hatch cover\""},{"$f":"'Weight sheet'!$C$221","v":"?"},{"$f":"'Weight sheet'!$D$221","v":"?"},{"$f":"'Weight sheet'!$F$221","v":0},{"$f":"'Weight sheet'!$H$221","v":0},{"$f":"$E$256*$D$256","v":0},58.25,{"$f":"$G$256*2.54","v":147.95500000000001},{"$f":"$F$256*$H$256","v":0},{"$f":"$E$256/SS_Density","v":0},{"$f":"$J$256*$D$256","v":0},{"$f":"$G$256","v":58.25},{"$f":"$L$256*2.54","v":147.95500000000001},{"$f":"$K$256*$M$256","v":0},5.26,{"$f":"$O$256*2.54","v":13.3604},{"$f":"$F$256*$P$256","v":0},{"$f":"$K$256*$P$256","v":0}]
[{"$f":"'Weight sheet'!$B$222","v":"Foam Block location \"Ogive Bottom Hatch cover\""},{"$f":"'Weight sheet'!$C$222","v":"?"},{"$f":"'Weight sheet'!$D$222","v":"?"},{"$f":"'Weight sheet'!$F$222","v":0},{"$f":"'Weight sheet'!$H$222","v":0},{"$f":"$E$257*$D$257","v":0},60,{"$f":"$G$257*2.54","v":152.4},{"$f":"$F$257*$H$257","v":0},{"$f":"$F$257/syntactic_foam_density","v":0},{"$f":"$J$257*$D$257","v":0},{"$f":"$G$257","v":60},{"$f":"$L$257*2.54","v":152.4},{"$f":"$K$257*$M$257","v":0},{"$f":"-4","v":-4},{"$f":"$O$257*2.54","v":-10.16},{"$f":"$F$257*$P$257","v":0},{"$f":"$K$257*$P$257","v":0}]
[{"$f":"'Weight sheet'!$B$223","v":"Hardware for Foam Block location \"Ogive Bottom Hatch cover\""},{"$f":"'Weight sheet'!$C$223","v":"?"},{"$f":"'Weight sheet'!$D$223","v":"?"},{"$f":"'Weight sheet'!$F$223","v":0},{"$f":"'Weight sheet'!$H$223","v":0},{"$f":"$E$258*$D$258","v":0},60,{"$f":"$G$258*2.54","v":152.4},{"$f":"$F$258*$H$258","v":0},{"$f":"$E$258/SS_Density","v":0},{"$f":"$J$258*$D$258","v":0},{"$f":"$G$258","v":60},{"$f":"$L$258*2.54","v":152.4},{"$f":"$K$258*$M$258","v":0},-5,{"$f":"$O$258*2.54","v":-12.7},{"$f":"$F$258*$P$258","v":0},{"$f":"$K$258*$P$258","v":0}]
[{"$f":"'Weight sheet'!$B$224","v":"Foam Block location \"C\""},{"$f":"'Weight sheet'!$C$224","v":"?"},{"$f":"'Weight sheet'!$D$224","v":"?"},{"$f":"'Weight sheet'!$F$224","v":0},{"$f":"'Weight sheet'!$H$224","v":0},{"$f":"$E$259*$D$259","v":0},0,{"$f":"$G$259*2.54","v":0},{"$f":"$F$259*$H$259","v":0},{"$f":"$F$259/syntactic_foam_density","v":0},{"$f":"$J$259*$D$259","v":0},{"$f":"$G$259","v":0},{"$f":"$L$259*2.54","v":0},{"$f":"$K$259*$M$259","v":0},0,{"$f":"$O$259*2.54","v":0},{"$f":"$F$259*$P$259","v":0},{"$f":"$K$259*$P$259","v":0}]
[{"$f":"'Weight sheet'!$B$225","v":"Hardware for Foam Block location \"C\""},{"$f":"'Weight sheet'!$C$225","v":"?"},{"$f":"'Weight sheet'!$D$225","v":"?"},{"$f":"'Weight sheet'!$F$225","v":0},{"$f":"'Weight sheet'!$H$225","v":0},{"$f":"$E$260*$D$260","v":0},0,{"$f":"$G$260*2.54","v":0},{"$f":"$F$260*$H$260","v":0},{"$f":"$E$260/SS_Density","v":0},{"$f":"$J$260*$D$260","v":0},{"$f":"$G$260","v":0},{"$f":"$L$260*2.54","v":0},{"$f":"$K$260*$M$260","v":0},0,{"$f":"$O$260*2.54","v":0},{"$f":"$F$260*$P$260","v":0},{"$f":"$K$260*$P$260","v":0}]
[{"$f":"'Weight sheet'!$B$226","v":"Foam Block location \"D\""},{"$f":"'Weight sheet'!$C$226","v":"?"},{"$f":"'Weight sheet'!$D$226","v":"?"},{"$f":"'Weight sheet'!$F$226","v":0},{"$f":"'Weight sheet'!$H$226","v":0},{"$f":"$E$261*$D$261","v":0},0,{"$f":"$G$261*2.54","v":0},{"$f":"$F$261*$H$261","v":0},{"$f":"$F$261/syntactic_foam_density","v":0},{"$f":"$J$261*$D$261","v":0},{"$f":"$G$261","v":0},{"$f":"$L$261*2.54","v":0},{"$f":"$K$261*$M$261","v":0},0,{"$f":"$O$261*2.54","v":0},{"$f":"$F$261*$P$261","v":0},{"$f":"$K$261*$P$261","v":0}]
[{"$f":"'Weight sheet'!$B$227","v":"Hardware for Foam Block location \"D\""},{"$f":"'Weight sheet'!$C$227","v":"?"},{"$f":"'Weight sheet'!$D$227","v":"?"},{"$f":"'Weight sheet'!$F$227","v":0},{"$f":"'Weight sheet'!$H$227","v":0},{"$f":"$E$262*$D$262","v":0},0,{"$f":"$G$262*2.54","v":0},{"$f":"$F$262*$H$262","v":0},{"$f":"$E$262/SS_Density","v":0},{"$f":"$J$262*$D$262","v":0},{"$f":"$G$262","v":0},{"$f":"$L$262*2.54","v":0},{"$f":"$K$262*$M$262","v":0},0,{"$f":"$O$262*2.54","v":0},{"$f":"$F$262*$P$262","v":0},{"$f":"$K$262*$P$262","v":0}]
[]
["Assy., Pupa",{"$f":"'Weight sheet'!$C$229","v":4199431},{"$f":"'Weight sheet'!$D$229","v":55486}]
[null,"Subtotal Weight",{"$f":"$C$286+$C$475+$C$481+$C$498+$C$511+SUM($F$268:$F$283)","v":38462.599999999991},"gm","diff"]
[null,"Scale Weight",{"$f":"'Weight sheet'!$H$231","v":38454},"gm",{"$f":"$C$266-$C$265","v":-8.5999999999912689},null,null,null,null,null,null,null,null,null,null,null,null,null,{"$f":"SUM($K$268:$K$523)","v":42743.90687644732}]
["Complete pupae volume - sum this sheet",null,42708.559363913104,"cc"]
[{"$f":"'Weight sheet'!$B$233","v":"Position B (Opt O2):  IE55 dummy plug"},{"$f":"'Weight sheet'!$C$233","v":4199651},{"$f":"'Weight sheet'!$D$233","v":55309},{"$f":"'Weight sheet'!$F$233","v":0},{"$f":"'Weight sheet'!$H$233","v":0},{"$f":"$E$268*$D$268","v":0},51.75,{"$f":"$G$268*2.54","v":131.44499999999999},{"$f":"$F$268*$H$268","v":0},{"$f":"$D$268*3.7","v":0},{"$f":"$J$268*$D$268","v":0},{"$f":"$G$268","v":51.75},{"$f":"$L$268*2.54","v":131.44499999999999},{"$f":"$K$268*$M$268","v":0},1.1499999999999999,{"$f":"$O$268*2.54","v":2.9209999999999998},{"$f":"$F$268*$P$268","v":0},{"$f":"$K$268*$P$268","v":0}]
[{"$f":"'Weight sheet'!$B$234","v":"Position C (WL-1):  IE55 dummy plug"},{"$f":"'Weight sheet'!$C$234","v":4199651},{"$f":"'Weight sheet'!$D$234","v":55309},{"$f":"'Weight sheet'!$F$234","v":0},{"$f":"'Weight sheet'!$H$234","v":0},{"$f":"$E$269*$D$269","v":0},51.75,{"$f":"$G$269*2.54","v":131.44499999999999},{"$f":"$F$269*$H$269","v":0},{"$f":"$D$269*3.7","v":0},{"$f":"$J$269*$D$269","v":0},{"$f":"$G$269","v":51.75},{"$f":"$L$269*2.54","v":131.44499999999999},{"$f":"$K$269*$M$269","v":0},0,{"$f":"$O$269*2.54","v":0},{"$f":"$F$269*$P$269","v":0},{"$f":"$K$269*$P$269","v":0}]
[{"$f":"'Weight sheet'!$B$235","v":"Position D (SBE O2): IE55 dummy plug"},{"$f":"'Weight sheet'!$C$235","v":4199651},{"$f":"'Weight sheet'!$D$235","v":55309},{"$f":"'Weight sheet'!$F$235","v":0},{"$f":"'Weight sheet'!$H$235","v":0},{"$f":"$E$270*$D$270","v":0},51.75,{"$f":"$G$270*2.54","v":131.44499999999999},{"$f":"$F$270*$H$270","v":0},{"$f":"$D$270*3.7","v":0},{"$f":"$J$270*$D$270","v":0},{"$f":"$G$270","v":51.75},{"$f":"$L$270*2.54","v":131.44499999999999},{"$f":"$K$270*$M$270","v":0},-1.1499999999999999,{"$f":"$O$270*2.54","v":-2.9209999999999998},{"$f":"$F$270*$P$270","v":0},{"$f":"$K$270*$P$270","v":0}]
[{"$f":"'Weight sheet'!$B$236","v":"Position E (WL-2):  IE55 dummy plug"},{"$f":"'Weight sheet'!$C$236","v":4199651},{"$f":"'Weight sheet'!$D$236","v":55309},{"$f":"'Weight sheet'!$F$236","v":0},{"$f":"'Weight sheet'!$H$236","v":0},{"$f":"$E$271*$D$271","v":0},51.75,{"$f":"$G$271*2.54","v":131.44499999999999},{"$f":"$F$271*$H$271","v":0},{"$f":"$D$271*3.7","v":0},{"$f":"$J$271*$D$271","v":0},{"$f":"$G$271","v":51.75},{"$f":"$L$271*2.54","v":131.44499999999999},{"$f":"$K$271*$M$271","v":0},-1.992,{"$f":"$O$271*2.54","v":-5.0596800000000002},{"$f":"$F$271*$P$271","v":0},{"$f":"$K$271*$P$271","v":0}]
[{"$f":"'Weight sheet'!$B$237","v":"Position F:  IE55 dummy plug"},{"$f":"'Weight sheet'!$C$236","v":4199651},{"$f":"'Weight sheet'!$D$236","v":55309},{"$f":"'Weight sheet'!$F$237","v":1},{"$f":"'Weight sheet'!$H$237","v":7.3},{"$f":"$E$272*$D$272","v":7.3},51.75,{"$f":"$G$272*2.54","v":131.44499999999999},{"$f":"$F$272*$H$272","v":959.54849999999988},{"$f":"$D$272*3.7","v":3.7},{"$f":"$J$272*$D$272","v":3.7},{"$f":"$G$272","v":51.75},{"$f":"$L$272*2.54","v":131.44499999999999},{"$f":"$K$272*$M$272","v":486.34649999999999},-1.992,{"$f":"$O$272*2.54","v":-5.0596800000000002},{"$f":"$F$272*$P$272","v":-36.935664000000003},{"$f":"$K$272*$P$272","v":-18.720816000000003}]
[{"$f":"'Weight sheet'!$B$238","v":"Position G: IE55 dummy plug"},{"$f":"'Weight sheet'!$C$236","v":4199651},{"$f":"'Weight sheet'!$D$236","v":55309},{"$f":"'Weight sheet'!$F$238","v":0},{"$f":"'Weight sheet'!$H$238","v":0},{"$f":"$E$273*$D$273","v":0},51.75,{"$f":"$G$273*2.54","v":131.44499999999999},{"$f":"$F$273*$H$273","v":0},{"$f":"$D$273*3.7","v":0},{"$f":"$J$273*$D$273","v":0},{"$f":"$G$273","v":51.75},{"$f":"$L$273*2.54","v":131.44499999999999},{"$f":"$K$273*$M$273","v":0},-1.1499999999999999,{"$f":"$O$273*2.54","v":-2.9209999999999998},{"$f":"$F$273*$P$273","v":0},{"$f":"$K$273*$P$273","v":0}]
[{"$f":"'Weight sheet'!$B$239","v":"Position H: IE55 dummy plug"},{"$f":"'Weight sheet'!$C$236","v":4199651},{"$f":"'Weight sheet'!$D$236","v":55309},{"$f":"'Weight sheet'!$F$239","v":0},{"$f":"'Weight sheet'!$H$239","v":0},{"$f":"$E$274*$D$274","v":0},51.75,{"$f":"$G$274*2.54","v":131.44499999999999},{"$f":"$F$274*$H$274","v":0},{"$f":"$D$274*3.7","v":0},{"$f":"$J$274*$D$274","v":0},{"$f":"$G$274","v":51.75},{"$f":"$L$274*2.54","v":131.44499999999999},{"$f":"$K$274*$M$274","v":0},1.1499999999999999,{"$f":"$O$274*2.54","v":2.9209999999999998},{"$f":"$F$274*$P$274","v":0},{"$f":"$K$274*$P$274","v":0}]
[{"$f":"'Weight sheet'!$B$240","v":"Posisiton I: IE55 dummy plug"},{"$f":"'Weight sheet'!$C$236","v":4199651},{"$f":"'Weight sheet'!$D$236","v":55309},{"$f":"'Weight sheet'!$F$240","v":0},{"$f":"'Weight sheet'!$H$240","v":0},{"$f":"$E$275*$D$275","v":0},51.75,{"$f":"$G$275*2.54","v":131.44499999999999},{"$f":"$F$275*$H$275","v":0},{"$f":"$D$275*3.7","v":0},{"$f":"$J$275*$D$275","v":0},{"$f":"$G$275","v":51.75},{"$f":"$L$275*2.54","v":131.44499999999999},{"$f":"$K$275*$M$275","v":0},1.992,{"$f":"$O$275*2.54","v":5.0596800000000002},{"$f":"$F$275*$P$275","v":0},{"$f":"$K$275*$P$275","v":0}]
[{"$f":"'Weight sheet'!$B$241","v":"Zinc Anode"},{"$f":"'Weight sheet'!$C$241","v":4000014},null,{"$f":"'Weight sheet'!$F$241","v":0},{"$f":"'Weight sheet'!$H$241","v":0},{"$f":"$E$276*$D$276","v":0},51.75,{"$f":"$G$276*2.54","v":131.44499999999999},{"$f":"$F$276*$H$276","v":0},{"$f":"$D$276*3.7","v":0},{"$f":"$J$276*$D$276","v":0},{"$f":"$G$276","v":51.75},{"$f":"$L$276*2.54","v":131.44499999999999},{"$f":"$K$276*$M$276","v":0},-2.2999999999999998,{"$f":"$O$276*2.54","v":-5.8419999999999996},{"$f":"$F$276*$P$276","v":0},{"$f":"$K$276*$P$276","v":0}]
[{"$f":"'Weight sheet'!$B$242","v":"O-Ring, E70-270, Endcap to Batt Hull"},{"$f":"'Weight sheet'!$C$242","v":4199059},{"$f":"'Weight sheet'!$D$242","v":52411},{"$f":"'Weight sheet'!$F$242","v":1},{"$f":"'Weight sheet'!$H$242","v":8.6},{"$f":"$E$277*$D$277","v":8.6},48.55,{"$f":"$G$277*2.54","v":123.31699999999999},{"$f":"$F$277*$H$277","v":1060.5261999999998},7.13,{"$f":"$J$277*$D$277","v":7.13},{"$f":"$G$277","v":48.55},{"$f":"$L$277*2.54","v":123.31699999999999},{"$f":"$K$277*$M$277","v":879.25020999999992},2.7,{"$f":"$O$277*2.54","v":6.8580000000000005},{"$f":"$F$277*$P$277","v":58.9788},{"$f":"$K$277*$P$277","v":48.897540000000006}]
[{"$f":"'Weight sheet'!$B$243","v":"(7x) 6-32 x 1/2 SHCS w/ LW, endcap to battery hull WITH ZINCs FOR OLDER SYSTEM"},{"$f":"'Weight sheet'!$C$243","v":"4199111 / 4199122"},{"$f":"'Weight sheet'!$D$243","v":"55183 / 55217 / 55214 / 49884"},{"$f":"'Weight sheet'!$F$243","v":1},{"$f":"'Weight sheet'!$H$243","v":13.9},{"$f":"$E$278*$D$278","v":13.9},48.64,{"$f":"$G$278*2.54","v":123.54560000000001},{"$f":"$F$278*$H$278","v":1717.2838400000001},{"$f":"$E$278/SS_Density","v":1.7316556621402768},{"$f":"$J$278*$D$278","v":1.7316556621402768},{"$f":"$G$278","v":48.64},{"$f":"$L$278*2.54","v":123.54560000000001},{"$f":"$K$278*$M$278","v":213.9384377725178},0,{"$f":"$O$278*2.54","v":0},{"$f":"$F$278*$P$278","v":0},{"$f":"$K$278*$P$278","v":0}]
[{"$f":"'Weight sheet'!$B$244","v":"O-Ring, E70-270,  Bulkhead to batt. hull"},{"$f":"'Weight sheet'!$C$244","v":4199059},{"$f":"'Weight sheet'!$D$244","v":52411},{"$f":"'Weight sheet'!$F$244","v":1},{"$f":"'Weight sheet'!$H$244","v":8.6},{"$f":"$E$279*$D$279","v":8.6},28.72,{"$f":"$G$279*2.54","v":72.948799999999991},{"$f":"$F$279*$H$279","v":627.35967999999991},7.13,{"$f":"$J$279*$D$279","v":7.13},{"$f":"$G$279","v":28.72},{"$f":"$L$279*2.54","v":72.948799999999991},{"$f":"$K$279*$M$279","v":520.12494399999991},0,{"$f":"$O$279*2.54","v":0},{"$f":"$F$279*$P$279","v":0},{"$f":"$K$279*$P$279","v":0}]
[{"$f":"'Weight sheet'!$B$245","v":"(8x) 6-32 x 1/2 SHCS w/ LW, bulkhead to battery hull WITH ZINCs FOR OLDER SYSTEM"},{"$f":"'Weight sheet'!$C$245","v":"4199111 / 4199122"},{"$f":"'Weight sheet'!$D$245","v":"55183 / 55217 / 55214 / 49884"},{"$f":"'Weight sheet'!$F$245","v":1},{"$f":"'Weight sheet'!$H$245","v":16.3},{"$f":"$E$280*$D$280","v":16.3},25.75,{"$f":"$G$280*2.54","v":65.405000000000001},{"$f":"$F$280*$H$280","v":1066.1015},{"$f":"$E$280/SS_Density","v":2.0306465678335619},{"$f":"$J$280*$D$280","v":2.0306465678335619},{"$f":"$G$280","v":25.75},{"$f":"$L$280*2.54","v":65.405000000000001},{"$f":"$K$280*$M$280","v":132.81443876915412},0,{"$f":"$O$280*2.54","v":0},{"$f":"$F$280*$P$280","v":0},{"$f":"$K$280*$P$280","v":0}]
[{"$f":"'Weight sheet'!$B$246","v":"(4x) 6-32 x 1/2 SHCS + #6 LW, rails to bulkhead"},{"$f":"'Weight sheet'!$C$246","v":"4199111 / 4199122"},{"$f":"'Weight sheet'!$D$246","v":"55183 / 55217"},{"$f":"'Weight sheet'!$F$246","v":1},{"$f":"'Weight sheet'!$H$246","v":5.3},{"$f":"$E$281*$D$281","v":5.3},23.41,{"$f":"$G$281*2.54","v":59.461400000000005},{"$f":"$F$281*$H$281","v":315.14542},0,{"$f":"$J$281*$D$281","v":0},{"$f":"$G$281","v":23.41},{"$f":"$L$281*2.54","v":59.461400000000005},{"$f":"$K$281*$M$281","v":0},0,{"$f":"$O$281*2.54","v":0},{"$f":"$F$281*$P$281","v":0},{"$f":"$K$281*$P$281","v":0}]
[{"$f":"'Weight sheet'!$B$247","v":"O-Ring, E70-263, elec hull to bulkhead"},{"$f":"'Weight sheet'!$C$247","v":4199058},{"$f":"'Weight sheet'!$D$247","v":52410},{"$f":"'Weight sheet'!$F$247","v":1},{"$f":"'Weight sheet'!$H$247","v":7.1},{"$f":"$E$282*$D$282","v":7.1},26.13,{"$f":"$G$282*2.54","v":66.370199999999997},{"$f":"$F$282*$H$282","v":471.22841999999997},5.76,{"$f":"$J$282*$D$282","v":5.76},{"$f":"$G$282","v":26.13},{"$f":"$L$282*2.54","v":66.370199999999997},{"$f":"$K$282*$M$282","v":382.29235199999999},0,{"$f":"$O$282*2.54","v":0},{"$f":"$F$282*$P$282","v":0},{"$f":"$K$282*$P$282","v":0}]
[{"$f":"'Weight sheet'!$B$248","v":"(8x) 6-32 x 1/2 SHCS + #6 LW, elec hull to bulkhead"},{"$f":"'Weight sheet'!$C$248","v":"4199111 / 4199122"},{"$f":"'Weight sheet'!$D$248","v":"55183 / 55217"},{"$f":"'Weight sheet'!$F$248","v":1},{"$f":"'Weight sheet'!$H$248","v":10.6},{"$f":"$E$283*$D$283","v":10.6},25.92,{"$f":"$G$283*2.54","v":65.836800000000011},{"$f":"$F$283*$H$283","v":697.87008000000014},0,{"$f":"$J$283*$D$283","v":0},{"$f":"$G$283","v":25.92},{"$f":"$L$283*2.54","v":65.836800000000011},{"$f":"$K$283*$M$283","v":0},0,{"$f":"$O$283*2.54","v":0},{"$f":"$F$283*$P$283","v":0},{"$f":"$K$283*$P$283","v":0}]
[]
["Assy., Aft Endcap",{"$f":"'Weight sheet'!$C$253","v":"4293521-00001"},{"$f":"'Weight sheet'!$D$253","v":"-"}]
[null,"Subtotal Weight",{"$f":"SUM($F$297:$F$469)","v":7290.0999999999976},"gm","diff"]
[null,"Scale Weight",{"$f":"'Weight sheet'!$H$256","v":7291},"gm",{"$f":"$C$287-$C$286","v":0.90000000000236469}]
[]
[null,"Hydraulic oil:                                                               End Cap Without Oil",{"$f":"'Weight sheet'!$H$258","v":5583},"gm"]
[null," End Cap With Oil",{"$f":"'Weight sheet'!$H$259","v":6700},"gm"]
[null,"Oil Added To System",{"$f":"'Weight sheet'!$H$260","v":1117},"gm"]
[null,"Volume of Oil In System",{"$f":"'Weight sheet'!$H$261","v":1357.3945801433954},"cc",{"$f":"Total_Oil_Vol","v":1357.3945801433954}]
[]
["Assy., Hydraulics drive system",{"$f":"'Weight sheet'!$C$268","v":4293235},{"$f":"'Weight sheet'!$D$268","v":"-"}]
[null,"Subtotal Weight",{"$f":"(SUM($F$297:$F$392))+$E$341-$F$341","v":4340.0999999999985},"gm","diff"]
[null,"Scale Weight",{"$f":"'Weight sheet'!$H$270","v":3978.2},"gm",{"$f":"$C$296-$C$295","v":-361.89999999999873}]
[{"$f":"'Weight sheet'!$B$272","v":"ENDCAP, HULL, AFT (6 - Port)"},{"$f":"'Weight sheet'!$C$272","v":4199325},{"$f":"'Weight sheet'!$D$272","v":49815},{"$f":"'Weight sheet'!$F$272","v":1},{"$f":"'Weight sheet'!$H$272","v":2022},{"$f":"$E$297*$D$297","v":2022},50.014000000000003,{"$f":"$G$297*2.54","v":127.03556},{"$f":"$F$297*$H$297","v":256865.90231999999},2885,{"$f":"$J$297*$D$297","v":2885},49.752000000000002,{"$f":"$L$297*2.54","v":126.37008},{"$f":"$K$297*$M$297","v":364577.68080000003},0,{"$f":"$O$297*2.54","v":0},{"$f":"$F$297*$P$297","v":0},{"$f":"$K$297*$P$297","v":0}]
[{"$f":"'Weight sheet'!$B$273","v":"(2x) PIN, SPRING, SLOTTED - 5/32\" DIA x .375L, 18-8 SS"},{"$f":"'Weight sheet'!$C$273","v":4199132},{"$f":"'Weight sheet'!$D$273","v":55248},{"$f":"'Weight sheet'!$F$273","v":1},{"$f":"'Weight sheet'!$H$273","v":1.1000000000000001},{"$f":"$E$298*$D$298","v":1.1000000000000001},48.41,{"$f":"$G$298*2.54","v":122.9614},{"$f":"$F$298*$H$298","v":135.25754000000001},0,{"$f":"$J$298*$D$298","v":0},{"$f":"$G$298","v":48.41},{"$f":"$L$298*2.54","v":122.9614},{"$f":"$K$298*$M$298","v":0},0,{"$f":"$O$298*2.54","v":0},{"$f":"$F$298*$P$298","v":0},{"$f":"$K$298*$P$298","v":0}]
[{"$f":"'Weight sheet'!$B$274","v":"FITTING, TUBE, MALE - RUN TEE 2 x 1/4\" TUBE, 1/8\" NPT M"},{"$f":"'Weight sheet'!$C$274","v":4250762},{"$f":"'Weight sheet'!$D$274","v":"-"},{"$f":"'Weight sheet'!$F$274","v":1},{"$f":"'Weight sheet'!$H$274","v":8.5},{"$f":"$E$299*$D$299","v":8.5},49.3,{"$f":"$G$299*2.54","v":125.22199999999999},{"$f":"$F$299*$H$299","v":1064.3869999999999},0,{"$f":"$J$299*$D$299","v":0},{"$f":"$G$299","v":49.3},{"$f":"$L$299*2.54","v":125.22199999999999},{"$f":"$K$299*$M$299","v":0},0,{"$f":"$O$299*2.54","v":0},{"$f":"$F$299*$P$299","v":0},{"$f":"$K$299*$P$299","v":0}]
[{"$f":"'Weight sheet'!$B$275","v":"FITTING, TUBE, MALE - CONNECTOR, 1/4\" OD, 7/16-20 SAE/MS, SS"},{"$f":"'Weight sheet'!$C$275","v":4199245},{"$f":"'Weight sheet'!$D$275","v":55506},{"$f":"'Weight sheet'!$F$275","v":1},{"$f":"'Weight sheet'!$H$275","v":27.6},{"$f":"$E$300*$D$300","v":27.6},49.3,{"$f":"$G$300*2.54","v":125.22199999999999},{"$f":"$F$300*$H$300","v":3456.1271999999999},0,{"$f":"$J$300*$D$300","v":0},{"$f":"$G$300","v":49.3},{"$f":"$L$300*2.54","v":125.22199999999999},{"$f":"$K$300*$M$300","v":0},0.5,{"$f":"$O$300*2.54","v":1.27},{"$f":"$F$300*$P$300","v":35.052},{"$f":"$K$300*$P$300","v":0}]
[{"$f":"'Weight sheet'!$B$276","v":"ASSY, CABLE - VBD VALVE - A1W19 (\"SKINNER VALVE\")"},{"$f":"'Weight sheet'!$C$276","v":4199367},{"$f":"'Weight sheet'!$D$276","v":52254},{"$f":"'Weight sheet'!$F$276","v":1},{"$f":"'Weight sheet'!$H$276","v":607.70000000000005},{"$f":"$E$301*$D$301","v":607.70000000000005},49.02,{"$f":"$G$301*2.54","v":124.5108},{"$f":"$F$301*$H$301","v":75665.213160000014},0,{"$f":"$J$301*$D$301","v":0},{"$f":"$G$301","v":49.02},{"$f":"$L$301*2.54","v":124.5108},{"$f":"$K$301*$M$301","v":0},0.6,{"$f":"$O$301*2.54","v":1.524},{"$f":"$F$301*$P$301","v":926.13480000000004},{"$f":"$K$301*$P$301","v":0}]
[{"$f":"'Weight sheet'!$B$277","v":"FITTING, TUBE, MALE - ADAPTER, 1/4\" TUBE, 1/8\" NPT M, SS"},{"$f":"'Weight sheet'!$C$277","v":4199072},{"$f":"'Weight sheet'!$D$277","v":52430},{"$f":"'Weight sheet'!$F$277","v":1},{"$f":"'Weight sheet'!$H$277","v":10.5},{"$f":"$E$302*$D$302","v":10.5},50.43,{"$f":"$G$302*2.54","v":128.09219999999999},{"$f":"$F$302*$H$302","v":1344.9680999999998},0,{"$f":"$J$302*$D$302","v":0},{"$f":"$G$302","v":50.43},{"$f":"$L$302*2.54","v":128.09219999999999},{"$f":"$K$302*$M$302","v":0},0.5,{"$f":"$O$302*2.54","v":1.27},{"$f":"$F$302*$P$302","v":13.335000000000001},{"$f":"$K$302*$P$302","v":0}]
[{"$f":"'Weight sheet'!$B$278","v":"FITTING, TUBE, MALE - BRANCH TEE 2 x 1/4\" TUBE, 1/8\" NPT M"},{"$f":"'Weight sheet'!$C$278","v":4250878},{"$f":"'Weight sheet'!$D$278","v":"-"},{"$f":"'Weight sheet'!$F$278","v":1},{"$f":"'Weight sheet'!$H$278","v":19},{"$f":"$E$303*$D$303","v":19},48.79,{"$f":"$G$303*2.54","v":123.92659999999999},{"$f":"$F$303*$H$303","v":2354.6053999999999},0,{"$f":"$J$303*$D$303","v":0},{"$f":"$G$303","v":48.79},{"$f":"$L$303*2.54","v":123.92659999999999},{"$f":"$K$303*$M$303","v":0},-0.5,{"$f":"$O$303*2.54","v":-1.27},{"$f":"$F$303*$P$303","v":-24.13},{"$f":"$K$303*$P$303","v":0}]
[]
["For STANDARD BOOST PUMP"]
[{"$f":"'Weight sheet'!$B$281","v":"Tubing, 1/4 DIA x 8\" (Cut 8.25\")"},{"$f":"'Weight sheet'!$C$281","v":4199064},{"$f":"'Weight sheet'!$D$281","v":52419},{"$f":"'Weight sheet'!$F$281","v":1},{"$f":"'Weight sheet'!$H$281","v":3.3},{"$f":"$E$306*$D$306","v":3.3},47,{"$f":"$G$306*2.54","v":119.38},{"$f":"$F$306*$H$306","v":393.95399999999995},0,{"$f":"$J$306*$D$306","v":0},{"$f":"$G$306","v":47},{"$f":"$L$306*2.54","v":119.38},{"$f":"$K$306*$M$306","v":0},0,{"$f":"$O$306*2.54","v":0},{"$f":"$F$306*$P$306","v":0},{"$f":"$K$306*$P$306","v":0}]
[{"$f":"'Weight sheet'!$B$282","v":"Tubing, 1/4 Dia x 6.0\" (Cut 6.5\")"},{"$f":"'Weight sheet'!$C$282","v":4199064},{"$f":"'Weight sheet'!$D$282","v":52419},{"$f":"'Weight sheet'!$F$282","v":1},{"$f":"'Weight sheet'!$H$282","v":2.6},{"$f":"$E$307*$D$307","v":2.6},47,{"$f":"$G$307*2.54","v":119.38},{"$f":"$F$307*$H$307","v":310.38799999999998},0,{"$f":"$J$307*$D$307","v":0},{"$f":"$G$307","v":47},{"$f":"$L$307*2.54","v":119.38},{"$f":"$K$307*$M$307","v":0},0,{"$f":"$O$307*2.54","v":0},{"$f":"$F$307*$P$307","v":0},{"$f":"$K$307*$P$307","v":0}]
[{"$f":"'Weight sheet'!$B$283","v":"Check Valve, Kepner 204 A-1"},{"$f":"'Weight sheet'!$C$283","v":4199084},{"$f":"'Weight sheet'!$D$283","v":52448},{"$f":"'Weight sheet'!$F$283","v":1},{"$f":"'Weight sheet'!$H$283","v":22.5},{"$f":"$E$308*$D$308","v":22.5},49.1,{"$f":"$G$308*2.54","v":124.714},{"$f":"$F$308*$H$308","v":2806.0650000000001},0,{"$f":"$J$308*$D$308","v":0},{"$f":"$G$308","v":49.1},{"$f":"$L$308*2.54","v":124.714},{"$f":"$K$308*$M$308","v":0},-0.5,{"$f":"$O$308*2.54","v":-1.27},{"$f":"$F$308*$P$308","v":-28.574999999999999},{"$f":"$K$308*$P$308","v":0}]
[{"$f":"'Weight sheet'!$B$284","v":"Union Elbow, Male, 1/4 tube x 1/4 tube, alum"},{"$f":"'Weight sheet'!$C$284","v":4199076},{"$f":"'Weight sheet'!$D$284","v":52435},{"$f":"'Weight sheet'!$F$284","v":1},{"$f":"'Weight sheet'!$H$284","v":16.2},{"$f":"$E$309*$D$309","v":16.2},50.43,{"$f":"$G$309*2.54","v":128.09219999999999},{"$f":"$F$309*$H$309","v":2075.0936399999996},0,{"$f":"$J$309*$D$309","v":0},{"$f":"$G$309","v":50.43},{"$f":"$L$309*2.54","v":128.09219999999999},{"$f":"$K$309*$M$309","v":0},-0.5,{"$f":"$O$309*2.54","v":-1.27},{"$f":"$F$309*$P$309","v":-20.573999999999998},{"$f":"$K$309*$P$309","v":0}]
[{"$f":"'Weight sheet'!$B$285","v":"Tubing, 1/4 DIA x 9.625\" (Cut 9.75\")"},{"$f":"'Weight sheet'!$C$285","v":4199064},{"$f":"'Weight sheet'!$D$285","v":52419},{"$f":"'Weight sheet'!$F$285","v":1},{"$f":"'Weight sheet'!$H$285","v":3.9},{"$f":"$E$310*$D$310","v":3.9},47,{"$f":"$G$310*2.54","v":119.38},{"$f":"$F$310*$H$310","v":465.58199999999999},0,{"$f":"$J$310*$D$310","v":0},{"$f":"$G$310","v":47},{"$f":"$L$310*2.54","v":119.38},{"$f":"$K$310*$M$310","v":0},0,{"$f":"$O$310*2.54","v":0},{"$f":"$F$310*$P$310","v":0},{"$f":"$K$310*$P$310","v":0}]
[{"$f":"'Weight sheet'!$B$286","v":"Run Tee, Male,1/4 tube x 1/4 tube x 1/8 NPT, alum"},{"$f":"'Weight sheet'!$C$286","v":4199075},{"$f":"'Weight sheet'!$D$286","v":52428},{"$f":"'Weight sheet'!$F$286","v":1},{"$f":"'Weight sheet'!$H$286","v":18.899999999999999},{"$f":"$E$311*$D$311","v":18.899999999999999},49.3,{"$f":"$G$311*2.54","v":125.22199999999999},{"$f":"$F$311*$H$311","v":2366.6957999999995},0,{"$f":"$J$311*$D$311","v":0},{"$f":"$G$311","v":49.3},{"$f":"$L$311*2.54","v":125.22199999999999},{"$f":"$K$311*$M$311","v":0},0,{"$f":"$O$311*2.54","v":0},{"$f":"$F$311*$P$311","v":0},{"$f":"$K$311*$P$311","v":0}]
[{"$f":"'Weight sheet'!$B$287","v":"Tubing, 1/4 Dia x 4.375\" (Cut 4.375\")"},{"$f":"'Weight sheet'!$C$287","v":4199064},{"$f":"'Weight sheet'!$D$287","v":52419},{"$f":"'Weight sheet'!$F$287","v":1},{"$f":"'Weight sheet'!$H$287","v":1.9},{"$f":"$E$312*$D$312","v":1.9},47,{"$f":"$G$312*2.54","v":119.38},{"$f":"$F$312*$H$312","v":226.82199999999997},0,{"$f":"$J$312*$D$312","v":0},{"$f":"$G$312","v":47},{"$f":"$L$312*2.54","v":119.38},{"$f":"$K$312*$M$312","v":0},0,{"$f":"$O$312*2.54","v":0},{"$f":"$F$312*$P$312","v":0},{"$f":"$K$312*$P$312","v":0}]
[]
["For HIGH VOL BOOST PUMP"]
[{"$f":"'Weight sheet'!$B$290","v":"TUBING, 1/4\" OD 310 PSI (9.0in)"},{"$f":"'Weight sheet'!$C$290","v":4263534},{"$f":"'Weight sheet'!$D$290","v":"-"},{"$f":"'Weight sheet'!$F$290","v":0},{"$f":"'Weight sheet'!$H$290","v":0},{"$f":"$E$315*$D$315","v":0},47,{"$f":"$G$315*2.54","v":119.38},{"$f":"$F$315*$H$315","v":0},0,{"$f":"$J$315*$D$315","v":0},{"$f":"$G$315","v":47},{"$f":"$L$315*2.54","v":119.38},{"$f":"$K$315*$M$315","v":0},0,{"$f":"$O$315*2.54","v":0},{"$f":"$F$315*$P$315","v":0},{"$f":"$K$315*$P$315","v":0}]
[{"$f":"'Weight sheet'!$B$291","v":"TUBING, 1/4\" OD 310 PSI (10.0in)"},{"$f":"'Weight sheet'!$C$291","v":4263534},{"$f":"'Weight sheet'!$D$291","v":52419},{"$f":"'Weight sheet'!$F$291","v":0},{"$f":"'Weight sheet'!$H$291","v":0},{"$f":"$E$316*$D$316","v":0},47,{"$f":"$G$316*2.54","v":119.38},{"$f":"$F$316*$H$316","v":0},0,{"$f":"$J$316*$D$316","v":0},{"$f":"$G$316","v":47},{"$f":"$L$316*2.54","v":119.38},{"$f":"$K$316*$M$316","v":0},0,{"$f":"$O$316*2.54","v":0},{"$f":"$F$316*$P$316","v":0},{"$f":"$K$316*$P$316","v":0}]
[{"$f":"'Weight sheet'!$B$292","v":"VALVE , CHECK, INLINE - SPRING POPPET 1/8\" NPT F. 1/8\" NPT M"},{"$f":"'Weight sheet'!$C$292","v":4199084},{"$f":"'Weight sheet'!$D$292","v":52448},{"$f":"'Weight sheet'!$F$292","v":0},{"$f":"'Weight sheet'!$H$292","v":0},{"$f":"$E$317*$D$317","v":0},49.1,{"$f":"$G$317*2.54","v":124.714},{"$f":"$F$317*$H$317","v":0},0,{"$f":"$J$317*$D$317","v":0},{"$f":"$G$317","v":49.1},{"$f":"$L$317*2.54","v":124.714},{"$f":"$K$317*$M$317","v":0},-0.5,{"$f":"$O$317*2.54","v":-1.27},{"$f":"$F$317*$P$317","v":0},{"$f":"$K$317*$P$317","v":0}]
[{"$f":"'Weight sheet'!$B$293","v":"TUBING, 1/4\" OD 310 PSI (8.0in)"},{"$f":"'Weight sheet'!$C$293","v":4263534},{"$f":"'Weight sheet'!$D$293","v":"-"},{"$f":"'Weight sheet'!$F$293","v":0},{"$f":"'Weight sheet'!$H$293","v":0},{"$f":"$E$318*$D$318","v":0},50.43,{"$f":"$G$318*2.54","v":128.09219999999999},{"$f":"$F$318*$H$318","v":0},0,{"$f":"$J$318*$D$318","v":0},{"$f":"$G$318","v":50.43},{"$f":"$L$318*2.54","v":128.09219999999999},{"$f":"$K$318*$M$318","v":0},0,{"$f":"$O$318*2.54","v":0},{"$f":"$F$318*$P$318","v":0},{"$f":"$K$318*$P$318","v":0}]
[{"$f":"'Weight sheet'!$B$294","v":"TUBING, 1/4\" OD 310 PSI (11.0in)"},{"$f":"'Weight sheet'!$C$294","v":4263534},{"$f":"'Weight sheet'!$D$294","v":"-"},{"$f":"'Weight sheet'!$F$294","v":0},{"$f":"'Weight sheet'!$H$294","v":0},{"$f":"$E$319*$D$319","v":0},47,{"$f":"$G$319*2.54","v":119.38},{"$f":"$F$319*$H$319","v":0},0,{"$f":"$J$319*$D$319","v":0},{"$f":"$G$319","v":47},{"$f":"$L$319*2.54","v":119.38},{"$f":"$K$319*$M$319","v":0},0,{"$f":"$O$319*2.54","v":0},{"$f":"$F$319*$P$319","v":0},{"$f":"$K$319*$P$319","v":0}]
[{"$f":"'Weight sheet'!$B$295","v":"TUBING, 1/4\" OD 310 PSI (4.375in)"},{"$f":"'Weight sheet'!$C$295","v":4263535},{"$f":"'Weight sheet'!$D$295","v":"-"},{"$f":"'Weight sheet'!$F$295","v":0},{"$f":"'Weight sheet'!$H$295","v":0},{"$f":"$E$320*$D$320","v":0},49.1,{"$f":"$G$320*2.54","v":124.714},{"$f":"$F$320*$H$320","v":0},0,{"$f":"$J$320*$D$320","v":0},{"$f":"$G$320","v":49.1},{"$f":"$L$320*2.54","v":124.714},{"$f":"$K$320*$M$320","v":0},0,{"$f":"$O$320*2.54","v":0},{"$f":"$F$320*$P$320","v":0},{"$f":"$K$320*$P$320","v":0}]
[{"$f":"'Weight sheet'!$B$296","v":"TUBING, 1/4\" OD 310 PSI (4.375in)"},{"$f":"'Weight sheet'!$C$296","v":4263536},{"$f":"'Weight sheet'!$D$296","v":"-"},{"$f":"'Weight sheet'!$F$296","v":0},{"$f":"'Weight sheet'!$H$296","v":0},{"$f":"$E$321*$D$321","v":0},49.1,{"$f":"$G$321*2.54","v":124.714},{"$f":"$F$321*$H$321","v":0},0,{"$f":"$J$321*$D$321","v":0},{"$f":"$G$321","v":49.1},{"$f":"$L$321*2.54","v":124.714},{"$f":"$K$321*$M$321","v":0},0,{"$f":"$O$321*2.54","v":0},{"$f":"$F$321*$P$321","v":0},{"$f":"$K$321*$P$321","v":0}]
[{"$f":"'Weight sheet'!$B$297","v":"FITTING, MALE - 1/4\" TUBE, 1/8\" NPT M"},{"$f":"'Weight sheet'!$C$297","v":4275380},{"$f":"'Weight sheet'!$D$297","v":"-"},{"$f":"'Weight sheet'!$F$297","v":0},{"$f":"'Weight sheet'!$H$297","v":0},{"$f":"$E$322*$D$322","v":0},49.3,{"$f":"$G$322*2.54","v":125.22199999999999},{"$f":"$F$322*$H$322","v":0},0,{"$f":"$J$322*$D$322","v":0},{"$f":"$G$322","v":49.3},{"$f":"$L$322*2.54","v":125.22199999999999},{"$f":"$K$322*$M$322","v":0},-0.5,{"$f":"$O$322*2.54","v":-1.27},{"$f":"$F$322*$P$322","v":0},{"$f":"$K$322*$P$322","v":0}]
[{"$f":"'Weight sheet'!$B$298","v":"TUBING, 1/4\" OD 310 PSI (1.25in)"},{"$f":"'Weight sheet'!$C$298","v":4263536},{"$f":"'Weight sheet'!$D$298","v":"-"},{"$f":"'Weight sheet'!$F$298","v":0},{"$f":"'Weight sheet'!$H$298","v":0},{"$f":"$E$323*$D$323","v":0},47,{"$f":"$G$323*2.54","v":119.38},{"$f":"$F$323*$H$323","v":0},0,{"$f":"$J$323*$D$323","v":0},{"$f":"$G$323","v":47},{"$f":"$L$323*2.54","v":119.38},{"$f":"$K$323*$M$323","v":0},0,{"$f":"$O$323*2.54","v":0},{"$f":"$F$323*$P$323","v":0},{"$f":"$K$323*$P$323","v":0}]
[{"$f":"'Weight sheet'!$B$299","v":"FITTING, TUBE, TEE - COUPLING 3 x 1/4\" TUBE"},{"$f":"'Weight sheet'!$C$299","v":4251058},{"$f":"'Weight sheet'!$D$299","v":"-"},{"$f":"'Weight sheet'!$F$299","v":0},{"$f":"'Weight sheet'!$H$299","v":0},{"$f":"$E$324*$D$324","v":0},49.3,{"$f":"$G$324*2.54","v":125.22199999999999},{"$f":"$F$324*$H$324","v":0},0,{"$f":"$J$324*$D$324","v":0},{"$f":"$G$324","v":49.3},{"$f":"$L$324*2.54","v":125.22199999999999},{"$f":"$K$324*$M$324","v":0},0,{"$f":"$O$324*2.54","v":0},{"$f":"$F$324*$P$324","v":0},{"$f":"$K$324*$P$324","v":0}]
[{"$f":"'Weight sheet'!$B$300","v":"FITTING, TUBE, MALE - 90DEG ELBOW, 1/4\" TUBE, 1/8\" NPT M"},{"$f":"'Weight sheet'!$C$300","v":4251059},{"$f":"'Weight sheet'!$D$300","v":"-"},{"$f":"'Weight sheet'!$F$300","v":0},{"$f":"'Weight sheet'!$H$300","v":0},{"$f":"$E$325*$D$325","v":0},50.43,{"$f":"$G$325*2.54","v":128.09219999999999},{"$f":"$F$325*$H$325","v":0},0,{"$f":"$J$325*$D$325","v":0},{"$f":"$G$325","v":50.43},{"$f":"$L$325*2.54","v":128.09219999999999},{"$f":"$K$325*$M$325","v":0},0,{"$f":"$O$325*2.54","v":0},{"$f":"$F$325*$P$325","v":0},{"$f":"$K$325*$P$325","v":0}]
[{"$f":"'Weight sheet'!$B$301","v":"FITTING, TUBE, MALE - 45DEG ELBOW, 1/4\" TUBE, 1/8\" NPT M"},{"$f":"'Weight sheet'!$C$301","v":4251060},{"$f":"'Weight sheet'!$D$301","v":"-"},{"$f":"'Weight sheet'!$F$301","v":0},{"$f":"'Weight sheet'!$H$301","v":0},{"$f":"$E$326*$D$326","v":0},50.43,{"$f":"$G$326*2.54","v":128.09219999999999},{"$f":"$F$326*$H$326","v":0},0,{"$f":"$J$326*$D$326","v":0},{"$f":"$G$326","v":50.43},{"$f":"$L$326*2.54","v":128.09219999999999},{"$f":"$K$326*$M$326","v":0},0,{"$f":"$O$326*2.54","v":0},{"$f":"$F$326*$P$326","v":0},{"$f":"$K$326*$P$326","v":0}]
[{"$f":"'Weight sheet'!$B$302","v":"VALVE, CHECK, INLINE - 1-2 PSI CRACK 2x 1/8\" NPT F, AL"},{"$f":"'Weight sheet'!$C$302","v":4259549},{"$f":"'Weight sheet'!$D$302","v":"-"},{"$f":"'Weight sheet'!$F$302","v":0},{"$f":"'Weight sheet'!$H$302","v":0},{"$f":"$E$327*$D$327","v":0},50.43,{"$f":"$G$327*2.54","v":128.09219999999999},{"$f":"$F$327*$H$327","v":0},0,{"$f":"$J$327*$D$327","v":0},{"$f":"$G$327","v":50.43},{"$f":"$L$327*2.54","v":128.09219999999999},{"$f":"$K$327*$M$327","v":0},0,{"$f":"$O$327*2.54","v":0},{"$f":"$F$327*$P$327","v":0},{"$f":"$K$327*$P$327","v":0}]
[]
[{"$f":"'Weight sheet'!$B$304","v":"WASHER, FLAT, STEEL, ZINC, SEAL"},{"$f":"'Weight sheet'!$C$304","v":4199043},{"$f":"'Weight sheet'!$D$304","v":52350},{"$f":"'Weight sheet'!$F$304","v":1},{"$f":"'Weight sheet'!$H$304","v":0.9},{"$f":"$E$329*$D$329","v":0.9},50.9,{"$f":"$G$329*2.54","v":129.286},{"$f":"$F$329*$H$329","v":116.3574},0,{"$f":"$J$329*$D$329","v":0},{"$f":"$G$329","v":50.9},{"$f":"$L$329*2.54","v":129.286},{"$f":"$K$329*$M$329","v":0},0,{"$f":"$O$329*2.54","v":0},{"$f":"$F$329*$P$329","v":0},{"$f":"$K$329*$P$329","v":0}]
[{"$f":"'Weight sheet'!$B$305","v":"SCREW, PUMP OUTLET"},{"$f":"'Weight sheet'!$C$305","v":4199400},{"$f":"'Weight sheet'!$D$305","v":52349},{"$f":"'Weight sheet'!$F$305","v":1},{"$f":"'Weight sheet'!$H$305","v":7.1},{"$f":"$E$330*$D$330","v":7.1},51.04,{"$f":"$G$330*2.54","v":129.64160000000001},{"$f":"$F$330*$H$330","v":920.45536000000004},0,{"$f":"$J$330*$D$330","v":0},{"$f":"$G$330","v":51.04},{"$f":"$L$330*2.54","v":129.64160000000001},{"$f":"$K$330*$M$330","v":0},0,{"$f":"$O$330*2.54","v":0},{"$f":"$F$330*$P$330","v":0},{"$f":"$K$330*$P$330","v":0}]
[{"$f":"'Weight sheet'!$B$306","v":"PUMP, HYDRAULIC - 3 PISTON (LEDUC)"},{"$f":"'Weight sheet'!$C$306","v":4199399},{"$f":"'Weight sheet'!$D$306","v":52348},{"$f":"'Weight sheet'!$F$306","v":1},{"$f":"'Weight sheet'!$H$306","v":316.5},{"$f":"$E$331*$D$331","v":316.5},49.58,{"$f":"$G$331*2.54","v":125.9332},{"$f":"$F$331*$H$331","v":39857.857799999998},0,{"$f":"$J$331*$D$331","v":0},{"$f":"$G$331","v":49.58},{"$f":"$L$331*2.54","v":125.9332},{"$f":"$K$331*$M$331","v":0},0,{"$f":"$O$331*2.54","v":0},{"$f":"$F$331*$P$331","v":0},{"$f":"$K$331*$P$331","v":0}]
[{"$f":"'Weight sheet'!$B$308","v":"ENDCAP, HYDRAULIC PUMP LEDUC"},{"$f":"'Weight sheet'!$C$308","v":4259549},{"$f":"'Weight sheet'!$D$308","v":"-"},{"$f":"'Weight sheet'!$F$308","v":1},{"$f":"'Weight sheet'!$H$308","v":110.8},{"$f":"$E$332*$D$332","v":110.8},47.72,{"$f":"$G$332*2.54","v":121.2088},{"$f":"$F$332*$H$332","v":13429.935039999998},0,{"$f":"$J$332*$D$332","v":0},{"$f":"$G$332","v":47.72},{"$f":"$L$332*2.54","v":121.2088},{"$f":"$K$332*$M$332","v":0},0,{"$f":"$O$332*2.54","v":0},{"$f":"$F$332*$P$332","v":0},{"$f":"$K$332*$P$332","v":0}]
[{"$f":"'Weight sheet'!$B$309","v":"BEARING, BALL - 8mm SHAFT, SS, OPEN "},{"$f":"'Weight sheet'!$C$309","v":4199093},{"$f":"'Weight sheet'!$D$309","v":52459},{"$f":"'Weight sheet'!$F$309","v":1},{"$f":"'Weight sheet'!$H$309","v":3.1},{"$f":"$E$333*$D$333","v":3.1},47.69,{"$f":"$G$333*2.54","v":121.1326},{"$f":"$F$333*$H$333","v":375.51105999999999},0,{"$f":"$J$333*$D$333","v":0},{"$f":"$G$333","v":47.69},{"$f":"$L$333*2.54","v":121.1326},{"$f":"$K$333*$M$333","v":0},0,{"$f":"$O$333*2.54","v":0},{"$f":"$F$333*$P$333","v":0},{"$f":"$K$333*$P$333","v":0}]
[{"$f":"'Weight sheet'!$B$310","v":"O-RING, BUNA-N, 70A -032"},{"$f":"'Weight sheet'!$C$310","v":4199055},{"$f":"'Weight sheet'!$D$310","v":52407},{"$f":"'Weight sheet'!$F$310","v":1},{"$f":"'Weight sheet'!$H$310","v":0.4},{"$f":"$E$334*$D$334","v":0.4},48.23,{"$f":"$G$334*2.54","v":122.5042},{"$f":"$F$334*$H$334","v":49.00168},0,{"$f":"$J$334*$D$334","v":0},{"$f":"$G$334","v":48.23},{"$f":"$L$334*2.54","v":122.5042},{"$f":"$K$334*$M$334","v":0},0,{"$f":"$O$334*2.54","v":0},{"$f":"$F$334*$P$334","v":0},{"$f":"$K$334*$P$334","v":0}]
[{"$f":"'Weight sheet'!$B$311","v":"FITTING, TUBE, MALE - PIPE ADAPTER, 10-32 UNF, 1/8\" TUBE"},{"$f":"'Weight sheet'!$C$311","v":4250882},{"$f":"'Weight sheet'!$D$311","v":"-"},{"$f":"'Weight sheet'!$F$311","v":1},{"$f":"'Weight sheet'!$H$311","v":16.2},{"$f":"$E$335*$D$335","v":16.2},47.75,{"$f":"$G$335*2.54","v":121.285},{"$f":"$F$335*$H$335","v":1964.8169999999998},0,{"$f":"$J$335*$D$335","v":0},{"$f":"$G$335","v":47.75},{"$f":"$L$335*2.54","v":121.285},{"$f":"$K$335*$M$335","v":0},1.1499999999999999,{"$f":"$O$335*2.54","v":2.9209999999999998},{"$f":"$F$335*$P$335","v":47.320199999999993},{"$f":"$K$335*$P$335","v":0}]
[{"$f":"'Weight sheet'!$B$312","v":"TUBING, 1/8\" OD 500 PSI (8.875in)"},{"$f":"'Weight sheet'!$C$312","v":4263530},{"$f":"'Weight sheet'!$D$312","v":"-"},{"$f":"'Weight sheet'!$F$312","v":1},{"$f":"'Weight sheet'!$H$312","v":0.9},{"$f":"$E$336*$D$336","v":0.9},45.17,{"$f":"$G$336*2.54","v":114.73180000000001},{"$f":"$F$336*$H$336","v":103.25862000000001},0,{"$f":"$J$336*$D$336","v":0},{"$f":"$G$336","v":45.17},{"$f":"$L$336*2.54","v":114.73180000000001},{"$f":"$K$336*$M$336","v":0},0,{"$f":"$O$336*2.54","v":0},{"$f":"$F$336*$P$336","v":0},{"$f":"$K$336*$P$336","v":0}]
[{"$f":"'Weight sheet'!$B$313","v":"SEAL, MAGNETIC  (Replace O-ring with 4214427 prior to weighing)"},{"$f":"'Weight sheet'!$C$313","v":4199046},{"$f":"'Weight sheet'!$D$313","v":52353},{"$f":"'Weight sheet'!$F$313","v":1},{"$f":"'Weight sheet'!$H$313","v":13.9},{"$f":"$E$337*$D$337","v":13.9},47.69,{"$f":"$G$337*2.54","v":121.1326},{"$f":"$F$337*$H$337","v":1683.74314},0,{"$f":"$J$337*$D$337","v":0},{"$f":"$G$337","v":47.69},{"$f":"$L$337*2.54","v":121.1326},{"$f":"$K$337*$M$337","v":0},0,{"$f":"$O$337*2.54","v":0},{"$f":"$F$337*$P$337","v":0},{"$f":"$K$337*$P$337","v":0}]
[{"$f":"'Weight sheet'!$B$314","v":"SCREW, SOCKET HEAD - ALLEN #6-32 x .500 L, 18-8 SS"},{"$f":"'Weight sheet'!$C$314","v":4199111},{"$f":"'Weight sheet'!$D$314","v":55183},{"$f":"'Weight sheet'!$F$314","v":1},{"$f":"'Weight sheet'!$H$314","v":7.8},{"$f":"$E$338*$D$338","v":7.8},48.12,{"$f":"$G$338*2.54","v":122.2248},{"$f":"$F$338*$H$338","v":953.35343999999998},0,{"$f":"$J$338*$D$338","v":0},{"$f":"$G$338","v":48.12},{"$f":"$L$338*2.54","v":122.2248},{"$f":"$K$338*$M$338","v":0},0,{"$f":"$O$338*2.54","v":0},{"$f":"$F$338*$P$338","v":0},{"$f":"$K$338*$P$338","v":0}]
[{"$f":"'Weight sheet'!$B$315","v":"PLUG - .250\" DIA, 3000PSI, Al / PIN - .250\" DIA PLUG, 3000PSI (LEE PLUG)"},{"$f":"'Weight sheet'!$C$315","v":"4199081 / 4199082"},{"$f":"'Weight sheet'!$D$315","v":"52445 / 52446"},{"$f":"'Weight sheet'!$F$315","v":1},{"$f":"'Weight sheet'!$H$315","v":0.4},{"$f":"$E$339*$D$339","v":0.4},51.512,{"$f":"$G$339*2.54","v":130.84048000000001},{"$f":"$F$339*$H$339","v":52.336192000000011},0,{"$f":"$J$339*$D$339","v":0},{"$f":"$G$339","v":51.512},{"$f":"$L$339*2.54","v":130.84048000000001},{"$f":"$K$339*$M$339","v":0},-0.5,{"$f":"$O$339*2.54","v":-1.27},{"$f":"$F$339*$P$339","v":-0.50800000000000001},{"$f":"$K$339*$P$339","v":0}]
[{"$f":"'Weight sheet'!$B$316","v":"VALVE, CHECK, BLADDER (altered Kepner 1106 A-1-1) / O-RING, BUNA-N, 90A -906 (N70 3-906)"},{"$f":"'Weight sheet'!$C$316","v":"4199338 / 4199056"},{"$f":"'Weight sheet'!$D$316","v":"49852 / 52408"},{"$f":"'Weight sheet'!$F$316","v":1},{"$f":"'Weight sheet'!$H$316","v":48},{"$f":"$E$340*$D$340","v":48},52.47,{"$f":"$G$340*2.54","v":133.27379999999999},{"$f":"$F$340*$H$340","v":6397.1423999999997},0,{"$f":"$J$340*$D$340","v":0},{"$f":"$G$340","v":52.47},{"$f":"$L$340*2.54","v":133.27379999999999},null,0,{"$f":"$O$340*2.54","v":0},{"$f":"$F$340*$P$340","v":0},{"$f":"$K$340*$P$340","v":0}]
[{"$f":"'Weight sheet'!$B$317","v":"BLADDER, ACCUMULATOR"},{"$f":"'Weight sheet'!$C$317","v":4199078},{"$f":"'Weight sheet'!$D$317","v":52441},{"$f":"'Weight sheet'!$F$317","v":1},{"$f":"'Weight sheet'!$H$317","v":113.2},{"$f":"IF($E$341=0,0,$E$341*$D$341+(Oil_wt_2-($C$20*Cal!$D$44*Oil_density)))","v":745.95678434589786},54.613,{"$f":"$G$341*2.54","v":138.71701999999999},{"$f":"$F$341*$H$341","v":103476.90217324559},{"$f":"Total_Oil_Vol-$C$20*Cal!$D$44+$E$341/1","v":882.13521004483891},{"$f":"$J$341*$D$341","v":882.13521004483891},{"$f":"$G$341","v":54.613},{"$f":"$L$341*2.54","v":138.71701999999999},{"$f":"$K$341*$M$341","v":122367.16757449412},0,{"$f":"$O$341*2.54","v":0},{"$f":"$F$341*$P$341","v":0},{"$f":"$K$341*$P$341","v":0}]
[{"$f":"'Weight sheet'!$B$318","v":"NUT, BLADDER"},{"$f":"'Weight sheet'!$C$318","v":4199318},{"$f":"'Weight sheet'!$D$318","v":49802},{"$f":"'Weight sheet'!$F$318","v":1},{"$f":"'Weight sheet'!$H$318","v":109.4},{"$f":"$E$342*$D$342","v":109.4},51.6,{"$f":"$G$342*2.54","v":131.06399999999999},{"$f":"$F$342*$H$342","v":14338.401599999999},{"$f":"$E$342/Alum_density","v":40.324364172502769},{"$f":"$J$342*$D$342","v":40.324364172502769},{"$f":"$G$342","v":51.6},{"$f":"$L$342*2.54","v":131.06399999999999},{"$f":"$K$342*$M$342","v":5285.0724659049029},0,{"$f":"$O$342*2.54","v":0},{"$f":"$F$342*$P$342","v":0},{"$f":"$K$342*$P$342","v":0}]
[{"$f":"'Weight sheet'!$B$319","v":"ASSY, CABLE, - INTERNAL COMMS - A1W17 (POSITION A {INTERNAL COMMS})"},{"$f":"'Weight sheet'!$C$319","v":4199365},{"$f":"'Weight sheet'!$D$319","v":"-"},{"$f":"'Weight sheet'!$F$319","v":1},{"$f":"'Weight sheet'!$H$319","v":10.9},{"$f":"$E$343*$D$343","v":10.9},51.512,{"$f":"$G$343*2.54","v":130.84048000000001},{"$f":"$F$343*$H$343","v":1426.1612320000002},0.79300000000000004,{"$f":"$J$343*$D$343","v":0.79300000000000004},{"$f":"$G$343","v":51.512},{"$f":"$L$343*2.54","v":130.84048000000001},{"$f":"$K$343*$M$343","v":103.75650064000001},1.992,{"$f":"$O$343*2.54","v":5.0596800000000002},{"$f":"$F$343*$P$343","v":55.150512000000006},{"$f":"$K$343*$P$343","v":4.0123262400000002}]
[{"$f":"'Weight sheet'!$B$320","v":"ASSY, CABLE, - RS232 SENSOR INTERFACE - A1W30 (POSITION B {OPT O2})"},{"$f":"'Weight sheet'!$C$320","v":4199375},{"$f":"'Weight sheet'!$D$320","v":"-"},{"$f":"'Weight sheet'!$F$320","v":1},{"$f":"'Weight sheet'!$H$320","v":11},{"$f":"$E$344*$D$344","v":11},51.512,{"$f":"$G$344*2.54","v":130.84048000000001},{"$f":"$F$344*$H$344","v":1439.2452800000001},0.79300000000000004,{"$f":"$J$344*$D$344","v":0.79300000000000004},{"$f":"$G$344","v":51.512},{"$f":"$L$344*2.54","v":130.84048000000001},{"$f":"$K$344*$M$344","v":103.75650064000001},1.1499999999999999,{"$f":"$O$344*2.54","v":2.9209999999999998},{"$f":"$F$344*$P$344","v":32.131},{"$f":"$K$344*$P$344","v":2.3163529999999999}]
[{"$f":"'Weight sheet'!$B$321","v":"ASSY, CABLE, - RS232 SENSOR INTERFACE - A1W30 (POSITION C {WL-1})"},{"$f":"'Weight sheet'!$C$321","v":4199375},{"$f":"'Weight sheet'!$D$321","v":"-"},{"$f":"'Weight sheet'!$F$321","v":1},{"$f":"'Weight sheet'!$H$321","v":10.9},{"$f":"$E$345*$D$345","v":10.9},51.512,{"$f":"$G$345*2.54","v":130.84048000000001},{"$f":"$F$345*$H$345","v":1426.1612320000002},0.79300000000000004,{"$f":"$J$345*$D$345","v":0.79300000000000004},{"$f":"$G$345","v":51.512},{"$f":"$L$345*2.54","v":130.84048000000001},{"$f":"$K$345*$M$345","v":103.75650064000001},0,{"$f":"$O$345*2.54","v":0},{"$f":"$F$345*$P$345","v":0},{"$f":"$K$345*$P$345","v":0}]
[{"$f":"'Weight sheet'!$B$322","v":"ASSY, CABLE, - RS232 SENSOR INTERFACE - A1W30 (POSITION D {SBE-O2})"},{"$f":"'Weight sheet'!$C$322","v":4199375},{"$f":"'Weight sheet'!$D$322","v":"-"},{"$f":"'Weight sheet'!$F$322","v":1},{"$f":"'Weight sheet'!$H$322","v":10.9},{"$f":"$E$346*$D$346","v":10.9},51.512,{"$f":"$G$346*2.54","v":130.84048000000001},{"$f":"$F$346*$H$346","v":1426.1612320000002},0.79300000000000004,{"$f":"$J$346*$D$346","v":0.79300000000000004},{"$f":"$G$346","v":51.512},{"$f":"$L$346*2.54","v":130.84048000000001},{"$f":"$K$346*$M$346","v":103.75650064000001},-1.1499999999999999,{"$f":"$O$346*2.54","v":-2.9209999999999998},{"$f":"$F$346*$P$346","v":-31.838899999999999},{"$f":"$K$346*$P$346","v":-2.3163529999999999}]
[{"$f":"'Weight sheet'!$B$323","v":"ASSY, CABLE, - RS232 SENSOR INTERFACE - A1W30 (POSITION E {WL-2})"},{"$f":"'Weight sheet'!$C$323","v":4199375},{"$f":"'Weight sheet'!$D$323","v":"-"},{"$f":"'Weight sheet'!$F$323","v":1},{"$f":"'Weight sheet'!$H$323","v":10.9},{"$f":"$E$347*$D$347","v":10.9},51.512,{"$f":"$G$347*2.54","v":130.84048000000001},{"$f":"$F$347*$H$347","v":1426.1612320000002},0.79300000000000004,{"$f":"$J$347*$D$347","v":0.79300000000000004},{"$f":"$G$347","v":51.512},{"$f":"$L$347*2.54","v":130.84048000000001},{"$f":"$K$347*$M$347","v":103.75650064000001},-1.992,{"$f":"$O$347*2.54","v":-5.0596800000000002},{"$f":"$F$347*$P$347","v":-55.150512000000006},{"$f":"$K$347*$P$347","v":-4.0123262400000002}]
[{"$f":"'Weight sheet'!$B$324","v":"ASSY, CABLE, - RS232 SENSOR INTERFACE - A1W30 (POSITION F)"},{"$f":"'Weight sheet'!$C$324","v":4199375},{"$f":"'Weight sheet'!$D$324","v":"-"},{"$f":"'Weight sheet'!$F$324","v":1},{"$f":"'Weight sheet'!$H$324","v":11},{"$f":"$E$348*$D$348","v":11},51.512,{"$f":"$G$348*2.54","v":130.84048000000001},{"$f":"$F$348*$H$348","v":1439.2452800000001},0.79300000000000004,{"$f":"$J$348*$D$348","v":0.79300000000000004},{"$f":"$G$348","v":51.512},{"$f":"$L$348*2.54","v":130.84048000000001},{"$f":"$K$348*$M$348","v":103.75650064000001},-1.992,{"$f":"$O$348*2.54","v":-5.0596800000000002},{"$f":"$F$348*$P$348","v":-55.656480000000002},{"$f":"$K$348*$P$348","v":-4.0123262400000002}]
[{"$f":"'Weight sheet'!$B$325","v":"ASSY, CABLE, - RS232 SENSOR INTERFACE - A1W30 (POSITION G)"},{"$f":"'Weight sheet'!$C$325","v":4199375},{"$f":"'Weight sheet'!$D$325","v":"-"},{"$f":"'Weight sheet'!$F$325","v":0},{"$f":"'Weight sheet'!$H$325","v":0},{"$f":"$E$349*$D$349","v":0},51.512,{"$f":"$G$349*2.54","v":130.84048000000001},{"$f":"$F$349*$H$349","v":0},0.79300000000000004,{"$f":"$J$349*$D$349","v":0},{"$f":"$G$349","v":51.512},{"$f":"$L$349*2.54","v":130.84048000000001},{"$f":"$K$349*$M$349","v":0},-1.1499999999999999,{"$f":"$O$349*2.54","v":-2.9209999999999998},{"$f":"$F$349*$P$349","v":0},{"$f":"$K$349*$P$349","v":0}]
[{"$f":"'Weight sheet'!$B$326","v":"ASSY, CABLE, - RS232 SENSOR INTERFACE - A1W30 (POSITION H)"},{"$f":"'Weight sheet'!$C$326","v":4199375},{"$f":"'Weight sheet'!$D$326","v":"-"},{"$f":"'Weight sheet'!$F$326","v":0},{"$f":"'Weight sheet'!$H$326","v":0},{"$f":"$E$350*$D$350","v":0},51.512,{"$f":"$G$350*2.54","v":130.84048000000001},{"$f":"$F$350*$H$350","v":0},0.79300000000000004,{"$f":"$J$350*$D$350","v":0},{"$f":"$G$350","v":51.512},{"$f":"$L$350*2.54","v":130.84048000000001},{"$f":"$K$350*$M$350","v":0},1.1499999999999999,{"$f":"$O$350*2.54","v":2.9209999999999998},{"$f":"$F$350*$P$350","v":0},{"$f":"$K$350*$P$350","v":0}]
[{"$f":"'Weight sheet'!$B$327","v":"ASSY, CABLE, - RS232 SENSOR INTERFACE - A1W30 (POSITION I)"},{"$f":"'Weight sheet'!$C$327","v":4199375},{"$f":"'Weight sheet'!$D$327","v":"-"},{"$f":"'Weight sheet'!$F$327","v":0},{"$f":"'Weight sheet'!$H$327","v":0},{"$f":"$E$351*$D$351","v":0},51.512,{"$f":"$G$351*2.54","v":130.84048000000001},{"$f":"$F$351*$H$351","v":0},0.79300000000000004,{"$f":"$J$351*$D$351","v":0},{"$f":"$G$351","v":51.512},{"$f":"$L$351*2.54","v":130.84048000000001},{"$f":"$K$351*$M$351","v":0},1.992,{"$f":"$O$351*2.54","v":5.0596800000000002},{"$f":"$F$351*$P$351","v":0},{"$f":"$K$351*$P$351","v":0}]
[{"$f":"'Weight sheet'!$B$328","v":"Anode Adaptor + O-Ring"},{"$f":"'Weight sheet'!$C$328","v":"4068150 / 4199057"},{"$f":"'Weight sheet'!$D$328","v":"-"},{"$f":"'Weight sheet'!$F$328","v":0},{"$f":"'Weight sheet'!$H$328","v":0},{"$f":"$E$352*$D$352","v":0},51.512,{"$f":"$G$352*2.54","v":130.84048000000001},{"$f":"$F$352*$H$352","v":0},0.79300000000000004,{"$f":"$J$352*$D$352","v":0},{"$f":"$G$352","v":51.512},{"$f":"$L$352*2.54","v":130.84048000000001},{"$f":"$K$352*$M$352","v":0},-2.2999999999999998,{"$f":"$O$352*2.54","v":-5.8419999999999996},{"$f":"$F$352*$P$352","v":0},{"$f":"$K$352*$P$352","v":0}]
[{"$f":"'Weight sheet'!$B$329","v":"ASSY, CABLE - IRIDIUM/GPS ANTENNA - A1W5 (LM-195 cable)"},{"$f":"'Weight sheet'!$C$329","v":4199354},{"$f":"'Weight sheet'!$D$329","v":52241},{"$f":"'Weight sheet'!$F$329","v":1},{"$f":"'Weight sheet'!$H$329","v":64.599999999999994},{"$f":"$E$353*$D$353","v":64.599999999999994},51.512,{"$f":"$G$353*2.54","v":130.84048000000001},{"$f":"$F$353*$H$353","v":8452.295008000001},6.8,{"$f":"$J$353*$D$353","v":6.8},{"$f":"$G$353","v":51.512},{"$f":"$L$353*2.54","v":130.84048000000001},{"$f":"$K$353*$M$353","v":889.71526400000005},0,{"$f":"$O$353*2.54","v":0},{"$f":"$F$353*$P$353","v":0},{"$f":"$K$353*$P$353","v":0}]
[{"$f":"'Weight sheet'!$B$330","v":"VALVE, PRESSURE RELIEF (DEEP SEA)"},{"$f":"'Weight sheet'!$C$330","v":4199085},{"$f":"'Weight sheet'!$D$330","v":52449},{"$f":"'Weight sheet'!$F$330","v":1},{"$f":"'Weight sheet'!$H$330","v":11.6},{"$f":"$E$354*$D$354","v":11.6},51.512,{"$f":"$G$354*2.54","v":130.84048000000001},{"$f":"$F$354*$H$354","v":1517.7495680000002},2.7,{"$f":"$J$354*$D$354","v":2.7},{"$f":"$G$354","v":51.512},{"$f":"$L$354*2.54","v":130.84048000000001},{"$f":"$K$354*$M$354","v":353.26929600000005},2.2999999999999998,{"$f":"$O$354*2.54","v":5.8419999999999996},{"$f":"$F$354*$P$354","v":67.767199999999988},{"$f":"$K$354*$P$354","v":15.773400000000001}]
[{"$f":"'Weight sheet'!$B$331","v":"PLATE, PUMP DRIVE"},{"$f":"'Weight sheet'!$C$331","v":4199320},{"$f":"'Weight sheet'!$D$331","v":49804},{"$f":"'Weight sheet'!$F$331","v":1},{"$f":"'Weight sheet'!$H$331","v":41.6},{"$f":"$E$355*$D$355","v":41.6},47.3,{"$f":"$G$355*2.54","v":120.142},{"$f":"$F$355*$H$355","v":4997.9071999999996},0,{"$f":"$J$355*$D$355","v":0},{"$f":"$G$355","v":47.3},{"$f":"$L$355*2.54","v":120.142},{"$f":"$K$355*$M$355","v":0},0.75,{"$f":"$O$355*2.54","v":1.905},{"$f":"$F$355*$P$355","v":79.248000000000005},{"$f":"$K$355*$P$355","v":0}]
[{"$f":"'Weight sheet'!$B$333","v":"ASSY, CABLE - PUMP MOTOR, VBD HIGH PRESSURE - A11W18"},{"$f":"'Weight sheet'!$C$333","v":4199366},{"$f":"'Weight sheet'!$D$333","v":52253},{"$f":"'Weight sheet'!$F$333","v":1},{"$f":"'Weight sheet'!$H$333","v":130.30000000000001},{"$f":"$E$356*$D$356","v":130.30000000000001},48.5,{"$f":"$G$356*2.54","v":123.19},{"$f":"$F$356*$H$356","v":16051.657000000001},0,{"$f":"$J$356*$D$356","v":0},{"$f":"$G$356","v":48.5},{"$f":"$L$356*2.54","v":123.19},{"$f":"$K$356*$M$356","v":0},1.8,{"$f":"$O$356*2.54","v":4.5720000000000001},{"$f":"$F$356*$P$356","v":595.73160000000007},{"$f":"$K$356*$P$356","v":0}]
[{"$f":"'Weight sheet'!$B$334","v":"(3X) SCREW, FLAT HEAD PHILLIPS, M2 x 0.4 X 6, 18-8 SS"},{"$f":"'Weight sheet'!$C$334","v":8254},{"$f":"'Weight sheet'!$D$334","v":55203},{"$f":"'Weight sheet'!$F$334","v":1},{"$f":"'Weight sheet'!$H$334","v":0.4},{"$f":"$E$357*$D$357","v":0.4},47.3,{"$f":"$G$357*2.54","v":120.142},{"$f":"$F$357*$H$357","v":48.056800000000003},0,{"$f":"$J$357*$D$357","v":0},{"$f":"$G$357","v":47.3},{"$f":"$L$357*2.54","v":120.142},{"$f":"$K$357*$M$357","v":0},1.8,{"$f":"$O$357*2.54","v":4.5720000000000001},{"$f":"$F$357*$P$357","v":1.8288000000000002},{"$f":"$K$357*$P$357","v":0}]
[{"$f":"'Weight sheet'!$B$335","v":"REDUCER, BORE - 3mm ID , AL"},{"$f":"'Weight sheet'!$C$335","v":4199044},{"$f":"'Weight sheet'!$D$335","v":52351},{"$f":"'Weight sheet'!$F$335","v":1},{"$f":"'Weight sheet'!$H$335","v":0.7},{"$f":"$E$358*$D$358","v":0.7},46.77,{"$f":"$G$358*2.54","v":118.79580000000001},{"$f":"$F$358*$H$358","v":83.157060000000001},0,{"$f":"$J$358*$D$358","v":0},{"$f":"$G$358","v":46.77},{"$f":"$L$358*2.54","v":118.79580000000001},{"$f":"$K$358*$M$358","v":0},0,{"$f":"$O$358*2.54","v":0},{"$f":"$F$358*$P$358","v":0},{"$f":"$K$358*$P$358","v":0}]
[{"$f":"'Weight sheet'!$B$336","v":"PULLEY, TIMING BELT, AL (LEDUC DRIVE MOTOR)"},{"$f":"'Weight sheet'!$C$336","v":4199045},{"$f":"'Weight sheet'!$D$336","v":52352},{"$f":"'Weight sheet'!$F$336","v":1},{"$f":"'Weight sheet'!$H$336","v":5.7},{"$f":"$E$359*$D$359","v":5.7},46.77,{"$f":"$G$359*2.54","v":118.79580000000001},{"$f":"$F$359*$H$359","v":677.13606000000016},0,{"$f":"$J$359*$D$359","v":0},{"$f":"$G$359","v":46.77},{"$f":"$L$359*2.54","v":118.79580000000001},{"$f":"$K$359*$M$359","v":0},1.85,{"$f":"$O$359*2.54","v":4.6990000000000007},{"$f":"$F$359*$P$359","v":26.784300000000005},{"$f":"$K$359*$P$359","v":0}]
[{"$f":"'Weight sheet'!$B$337","v":"(6X) SCREW, FLAT HEAD - ALLEN, #4-40 x .375, 18-8 SS"},{"$f":"'Weight sheet'!$C$337","v":17437},{"$f":"'Weight sheet'!$D$337","v":55229},{"$f":"'Weight sheet'!$F$337","v":1},{"$f":"'Weight sheet'!$H$337","v":3},{"$f":"$E$360*$D$360","v":3},47.28,{"$f":"$G$360*2.54","v":120.0912},{"$f":"$F$360*$H$360","v":360.27359999999999},0,{"$f":"$J$360*$D$360","v":0},{"$f":"$G$360","v":47.28},{"$f":"$L$360*2.54","v":120.0912},{"$f":"$K$360*$M$360","v":0},0,{"$f":"$O$360*2.54","v":0},{"$f":"$F$360*$P$360","v":0},{"$f":"$K$360*$P$360","v":0}]
[{"$f":"'Weight sheet'!$B$338","v":"PULLEY, PUMP (LEDUC PUMP PULLEY)"},{"$f":"'Weight sheet'!$C$338","v":4199321},{"$f":"'Weight sheet'!$D$338","v":49806},{"$f":"'Weight sheet'!$F$338","v":1},{"$f":"'Weight sheet'!$H$338","v":91.5},{"$f":"$E$361*$D$361","v":91.5},46.77,{"$f":"$G$361*2.54","v":118.79580000000001},{"$f":"$F$361*$H$361","v":10869.815700000001},0,{"$f":"$J$361*$D$361","v":0},{"$f":"$G$361","v":46.77},{"$f":"$L$361*2.54","v":118.79580000000001},{"$f":"$K$361*$M$361","v":0},0,{"$f":"$O$361*2.54","v":0},{"$f":"$F$361*$P$361","v":0},{"$f":"$K$361*$P$361","v":0}]
[{"$f":"'Weight sheet'!$B$339","v":"BELT, TIMING 6mm WIDE, NEOPRENE"},{"$f":"'Weight sheet'!$C$339","v":4199048},{"$f":"'Weight sheet'!$D$339","v":52357},{"$f":"'Weight sheet'!$F$339","v":1},{"$f":"'Weight sheet'!$H$339","v":3.5},{"$f":"$E$362*$D$362","v":3.5},46.77,{"$f":"$G$362*2.54","v":118.79580000000001},{"$f":"$F$362*$H$362","v":415.78530000000006},0,{"$f":"$J$362*$D$362","v":0},{"$f":"$G$362","v":46.77},{"$f":"$L$362*2.54","v":118.79580000000001},{"$f":"$K$362*$M$362","v":0},0.5,{"$f":"$O$362*2.54","v":1.27},{"$f":"$F$362*$P$362","v":4.4450000000000003},{"$f":"$K$362*$P$362","v":0}]
[{"$f":"'Weight sheet'!$B$340","v":"COVER, BELT, PUMP DRIVE"},{"$f":"'Weight sheet'!$C$340","v":4199429},{"$f":"'Weight sheet'!$D$340","v":55476},{"$f":"'Weight sheet'!$F$340","v":1},{"$f":"'Weight sheet'!$H$340","v":18.399999999999999},{"$f":"$E$363*$D$363","v":18.399999999999999},46.5,{"$f":"$G$363*2.54","v":118.11},{"$f":"$F$363*$H$363","v":2173.2239999999997},0,{"$f":"$J$363*$D$363","v":0},{"$f":"$G$363","v":46.5},{"$f":"$L$363*2.54","v":118.11},{"$f":"$K$363*$M$363","v":0},0.75,{"$f":"$O$363*2.54","v":1.905},{"$f":"$F$363*$P$363","v":35.052},{"$f":"$K$363*$P$363","v":0}]
[{"$f":"'Weight sheet'!$B$341","v":"(4X) SCREW, SOCKET HEAD - ALLEN, #4-40 x .250, SS"},{"$f":"'Weight sheet'!$C$341","v":2549},{"$f":"'Weight sheet'!$D$341","v":"-"},{"$f":"'Weight sheet'!$F$341","v":1},{"$f":"'Weight sheet'!$H$341","v":2},{"$f":"$E$364*$D$364","v":2},46.625,{"$f":"$G$364*2.54","v":118.42749999999999},{"$f":"$F$364*$H$364","v":236.85499999999999},0,{"$f":"$J$364*$D$364","v":0},{"$f":"$G$364","v":46.625},{"$f":"$L$364*2.54","v":118.42749999999999},{"$f":"$K$364*$M$364","v":0},0,{"$f":"$O$364*2.54","v":0},{"$f":"$F$364*$P$364","v":0},{"$f":"$K$364*$P$364","v":0}]
[{"$f":"'Weight sheet'!$B$342","v":"(2x) 6-32 x 1/2 SHCS + #6 LW, boost pump bracket to endcap"},{"$f":"'Weight sheet'!$C$342","v":"4199111 / 4199122"},{"$f":"'Weight sheet'!$D$342","v":"55183 / 55217"},{"$f":"'Weight sheet'!$F$342","v":1},{"$f":"'Weight sheet'!$H$342","v":2.6},{"$f":"$E$365*$D$365","v":2.6},47.64,{"$f":"$G$365*2.54","v":121.0056},{"$f":"$F$365*$H$365","v":314.61456000000004},0,{"$f":"$J$365*$D$365","v":0},{"$f":"$G$365","v":47.64},{"$f":"$L$365*2.54","v":121.0056},{"$f":"$K$365*$M$365","v":0},1,{"$f":"$O$365*2.54","v":2.54},{"$f":"$F$365*$P$365","v":6.6040000000000001},{"$f":"$K$365*$P$365","v":0}]
[{"$f":"'Weight sheet'!$B$343","v":"Grounding Strap 27.5\""},null,null,{"$f":"'Weight sheet'!$F$343","v":0},{"$f":"'Weight sheet'!$H$343","v":0},{"$f":"$E$366*$D$366","v":0},43.9,{"$f":"$G$366*2.54","v":111.506},{"$f":"$F$366*$H$366","v":0},0,{"$f":"$J$366*$D$366","v":0},{"$f":"$G$366","v":43.9},{"$f":"$L$366*2.54","v":111.506},{"$f":"$K$366*$M$366","v":0},0,{"$f":"$O$366*2.54","v":0},{"$f":"$F$366*$P$366","v":0},{"$f":"$K$366*$P$366","v":0}]
[]
[{"$f":"'Weight sheet'!$B$345","v":"Assy., Boost Pump (Standard)"},{"$f":"'Weight sheet'!$C$352","v":8254},{"$f":"'Weight sheet'!$D$352","v":55203}]
[null,"Subtotal Weight",{"$f":"SUM($F$371:$F$380)","v":384.3},"gm","diff"]
[null,"Scale Weight",{"$f":"'Weight sheet'!$H$347","v":384},"gm",{"$f":"$C$370-$C$369","v":-0.30000000000001137}]
[{"$f":"'Weight sheet'!$B$349","v":"Pump Bracket"},{"$f":"'Weight sheet'!$C$349","v":4199322},{"$f":"'Weight sheet'!$D$349","v":49808},{"$f":"'Weight sheet'!$F$349","v":1},{"$f":"'Weight sheet'!$H$349","v":21.8},{"$f":"$E$371*$D$371","v":21.8},48.91,{"$f":"$G$371*2.54","v":124.23139999999999},{"$f":"$F$371*$H$371","v":2708.2445199999997},0,{"$f":"$J$371*$D$371","v":0},{"$f":"$G$371","v":48.91},{"$f":"$L$371*2.54","v":124.23139999999999},{"$f":"$K$371*$M$371","v":0},0,{"$f":"$O$371*2.54","v":0},{"$f":"$F$371*$P$371","v":0},{"$f":"$K$371*$P$371","v":0}]
[{"$f":"'Weight sheet'!$B$350","v":"Motor, Chrge Pump w/ W34"},{"$f":"'Weight sheet'!$C$350","v":4199384},{"$f":"'Weight sheet'!$D$350","v":52288},{"$f":"'Weight sheet'!$F$350","v":1},{"$f":"'Weight sheet'!$H$350","v":59.7},{"$f":"$E$372*$D$372","v":59.7},48.9,{"$f":"$G$372*2.54","v":124.206},{"$f":"$F$372*$H$372","v":7415.0982000000004},0,{"$f":"$J$372*$D$372","v":0},{"$f":"$G$372","v":48.9},{"$f":"$L$372*2.54","v":124.206},{"$f":"$K$372*$M$372","v":0},1,{"$f":"$O$372*2.54","v":2.54},{"$f":"$F$372*$P$372","v":151.63800000000001},{"$f":"$K$372*$P$372","v":0}]
[{"$f":"'Weight sheet'!$B$352","v":"(2x) M2 x 6 FHMS, motor to bracket"},{"$f":"'Weight sheet'!$C$352","v":8254},{"$f":"'Weight sheet'!$D$352","v":55203},{"$f":"'Weight sheet'!$F$352","v":1},{"$f":"'Weight sheet'!$H$352","v":0.2},{"$f":"$E$373*$D$373","v":0.2},48.9,{"$f":"$G$373*2.54","v":124.206},{"$f":"$F$373*$H$373","v":24.841200000000001},0,{"$f":"$J$373*$D$373","v":0},{"$f":"$G$373","v":48.9},{"$f":"$L$373*2.54","v":124.206},{"$f":"$K$373*$M$373","v":0},0,{"$f":"$O$373*2.54","v":0},{"$f":"$F$373*$P$373","v":0},{"$f":"$K$373*$P$373","v":0}]
[{"$f":"'Weight sheet'!$B$353","v":"Magnet Rotor Housing"},{"$f":"'Weight sheet'!$C$353","v":4199092},{"$f":"'Weight sheet'!$D$353","v":52457},{"$f":"'Weight sheet'!$F$353","v":1},{"$f":"'Weight sheet'!$H$353","v":10.4},{"$f":"$E$374*$D$374","v":10.4},48.9,{"$f":"$G$374*2.54","v":124.206},{"$f":"$F$374*$H$374","v":1291.7424000000001},0,{"$f":"$J$374*$D$374","v":0},{"$f":"$G$374","v":48.9},{"$f":"$L$374*2.54","v":124.206},{"$f":"$K$374*$M$374","v":0},-0.4,{"$f":"$O$374*2.54","v":-1.016},{"$f":"$F$374*$P$374","v":-10.5664},{"$f":"$K$374*$P$374","v":0}]
[{"$f":"'Weight sheet'!$B$354","v":"(4x) 6-32 x 1/4 PHMS, bracket to housing"},{"$f":"'Weight sheet'!$C$354","v":4146090},{"$f":"'Weight sheet'!$D$354","v":55209},{"$f":"'Weight sheet'!$F$354","v":1},{"$f":"'Weight sheet'!$H$354","v":3},{"$f":"$E$375*$D$375","v":3},48.9,{"$f":"$G$375*2.54","v":124.206},{"$f":"$F$375*$H$375","v":372.61799999999999},0,{"$f":"$J$375*$D$375","v":0},{"$f":"$G$375","v":48.9},{"$f":"$L$375*2.54","v":124.206},{"$f":"$K$375*$M$375","v":0},0,{"$f":"$O$375*2.54","v":0},{"$f":"$F$375*$P$375","v":0},{"$f":"$K$375*$P$375","v":0}]
[{"$f":"'Weight sheet'!$B$355","v":"Rotary Magnet"},{"$f":"'Weight sheet'!$C$355","v":4199090},{"$f":"'Weight sheet'!$D$355","v":52455},{"$f":"'Weight sheet'!$F$355","v":1},{"$f":"'Weight sheet'!$H$355","v":17.600000000000001},{"$f":"$E$376*$D$376","v":17.600000000000001},48.9,{"$f":"$G$376*2.54","v":124.206},{"$f":"$F$376*$H$376","v":2186.0256000000004},0,{"$f":"$J$376*$D$376","v":0},{"$f":"$G$376","v":48.9},{"$f":"$L$376*2.54","v":124.206},{"$f":"$K$376*$M$376","v":0},-0.4,{"$f":"$O$376*2.54","v":-1.016},{"$f":"$F$376*$P$376","v":-17.881600000000002},{"$f":"$K$376*$P$376","v":0}]
[{"$f":"'Weight sheet'!$B$356","v":"Pumphead, Micropump + mounting plate + (3x) 4-40 x 3/8 FHMS  "},{"$f":"'Weight sheet'!$C$356","v":"4199051 / 4199091 / 17437"},{"$f":"'Weight sheet'!$D$356","v":"52360 / 52456 / 55229"},{"$f":"'Weight sheet'!$F$356","v":1},{"$f":"'Weight sheet'!$H$356","v":224.3},{"$f":"$E$377*$D$377","v":224.3},48.9,{"$f":"$G$377*2.54","v":124.206},{"$f":"$F$377*$H$377","v":27859.4058},0,{"$f":"$J$377*$D$377","v":0},{"$f":"$G$377","v":48.9},{"$f":"$L$377*2.54","v":124.206},{"$f":"$K$377*$M$377","v":0},-0.8,{"$f":"$O$377*2.54","v":-2.032},{"$f":"$F$377*$P$377","v":-455.77760000000001},{"$f":"$K$377*$P$377","v":0}]
[{"$f":"'Weight sheet'!$B$358","v":"(4x) 4-40 x 3/16 SHCS + #4 LW, housing to flange"},{"$f":"'Weight sheet'!$C$358","v":"4199155 / 19928"},{"$f":"'Weight sheet'!$D$358","v":"55296 / 55233"},{"$f":"'Weight sheet'!$F$358","v":1},{"$f":"'Weight sheet'!$H$358","v":2},{"$f":"$E$378*$D$378","v":2},48.9,{"$f":"$G$378*2.54","v":124.206},{"$f":"$F$378*$H$378","v":248.41200000000001},0,{"$f":"$J$378*$D$378","v":0},{"$f":"$G$378","v":48.9},{"$f":"$L$378*2.54","v":124.206},{"$f":"$K$378*$M$378","v":0},-0.5,{"$f":"$O$378*2.54","v":-1.27},{"$f":"$F$378*$P$378","v":-2.54},{"$f":"$K$378*$P$378","v":0}]
[{"$f":"'Weight sheet'!$B$359","v":"(2x) Elbow, 1/8 npt x 1/4 tube, alum"},{"$f":"'Weight sheet'!$C$359","v":4251059},{"$f":"'Weight sheet'!$D$359","v":52431},{"$f":"'Weight sheet'!$F$359","v":1},{"$f":"'Weight sheet'!$H$359","v":25},{"$f":"$E$379*$D$379","v":25},48.9,{"$f":"$G$379*2.54","v":124.206},{"$f":"$F$379*$H$379","v":3105.15},0,{"$f":"$J$379*$D$379","v":0},{"$f":"$G$379","v":48.9},{"$f":"$L$379*2.54","v":124.206},{"$f":"$K$379*$M$379","v":0},-0.9,{"$f":"$O$379*2.54","v":-2.286},{"$f":"$F$379*$P$379","v":-57.15},{"$f":"$K$379*$P$379","v":0}]
[{"$f":"'Weight sheet'!$B$360","v":"Filter, Balston"},{"$f":"'Weight sheet'!$C$360","v":4199068},{"$f":"'Weight sheet'!$D$360","v":52425},{"$f":"'Weight sheet'!$F$360","v":1},{"$f":"'Weight sheet'!$H$360","v":20.3},{"$f":"$E$380*$D$380","v":20.3},47,{"$f":"$G$380*2.54","v":119.38},{"$f":"$F$380*$H$380","v":2423.4140000000002},0,{"$f":"$J$380*$D$380","v":0},{"$f":"$G$380","v":47},{"$f":"$L$380*2.54","v":119.38},{"$f":"$K$380*$M$380","v":0},0,{"$f":"$O$380*2.54","v":0},{"$f":"$F$380*$P$380","v":0},{"$f":"$K$380*$P$380","v":0}]
[]
[{"$f":"'Weight sheet'!$B$363","v":"ASSY, PUMP, BOOST (Enhanced)"},{"$f":"'Weight sheet'!$C$363","v":4254582},{"$f":"'Weight sheet'!$D$363","v":"-"}]
[null,"Subtotal Weight",{"$f":"SUM($F$385:$F$392)","v":0},"gm","diff"]
[null,"Scale Weight",{"$f":"'Weight sheet'!$H$365","v":0},"gm",{"$f":"$C$384-$C$383","v":0}]
[{"$f":"'Weight sheet'!$B$366","v":"BRACKET, BOOST PUMP"},{"$f":"'Weight sheet'!$C$366","v":4250419},{"$f":"'Weight sheet'!$D$366","v":"-"},{"$f":"'Weight sheet'!$F$366","v":0},{"$f":"'Weight sheet'!$H$366","v":0},{"$f":"$E$385*$D$385","v":0},48.91,{"$f":"$G$385*2.54","v":124.23139999999999},{"$f":"$F$385*$H$385","v":0},0,{"$f":"$J$385*$D$385","v":0},{"$f":"$G$385","v":48.91},{"$f":"$L$385*2.54","v":124.23139999999999},{"$f":"$K$385*$M$385","v":0},0,{"$f":"$O$385*2.54","v":0},{"$f":"$F$385*$P$385","v":0},{"$f":"$K$385*$P$385","v":0}]
[{"$f":"'Weight sheet'!$B$367","v":"ASSY, CABLE, MOTOR, BOOST PUMP HIGH VOL"},{"$f":"'Weight sheet'!$C$367","v":4261167},{"$f":"'Weight sheet'!$D$367","v":"-"},{"$f":"'Weight sheet'!$F$367","v":0},{"$f":"'Weight sheet'!$H$367","v":0},{"$f":"$E$386*$D$386","v":0},48.9,{"$f":"$G$386*2.54","v":124.206},{"$f":"$F$386*$H$386","v":0},0,{"$f":"$J$386*$D$386","v":0},{"$f":"$G$386","v":48.9},{"$f":"$L$386*2.54","v":124.206},{"$f":"$K$386*$M$386","v":0},1,{"$f":"$O$386*2.54","v":2.54},{"$f":"$F$386*$P$386","v":0},{"$f":"$K$386*$P$386","v":0}]
[{"$f":"'Weight sheet'!$B$369","v":"(4X) SCREW, FLAT HEAD - PHILLIPS, M3 X 0.5 X 8, 18-8 SS"},{"$f":"'Weight sheet'!$C$369","v":4260277},{"$f":"'Weight sheet'!$D$369","v":"-"},{"$f":"'Weight sheet'!$F$369","v":0},{"$f":"'Weight sheet'!$H$369","v":0},{"$f":"$E$387*$D$387","v":0},48.9,{"$f":"$G$387*2.54","v":124.206},{"$f":"$F$387*$H$387","v":0},0,{"$f":"$J$387*$D$387","v":0},{"$f":"$G$387","v":48.9},{"$f":"$L$387*2.54","v":124.206},{"$f":"$K$387*$M$387","v":0},0,{"$f":"$O$387*2.54","v":0},{"$f":"$F$387*$P$387","v":0},{"$f":"$K$387*$P$387","v":0}]
[{"$f":"'Weight sheet'!$B$370","v":"HOUSING, PUMP - RE-MAX 29"},{"$f":"'Weight sheet'!$C$370","v":4249845},{"$f":"'Weight sheet'!$D$370","v":"-"},{"$f":"'Weight sheet'!$F$370","v":0},{"$f":"'Weight sheet'!$H$370","v":0},{"$f":"$E$388*$D$388","v":0},48.9,{"$f":"$G$388*2.54","v":124.206},{"$f":"$F$388*$H$388","v":0},0,{"$f":"$J$388*$D$388","v":0},{"$f":"$G$388","v":48.9},{"$f":"$L$388*2.54","v":124.206},{"$f":"$K$388*$M$388","v":0},-0.4,{"$f":"$O$388*2.54","v":-1.016},{"$f":"$F$388*$P$388","v":0},{"$f":"$K$388*$P$388","v":0}]
[{"$f":"'Weight sheet'!$B$371","v":"(10X) SCREW, SOCKET HEAD, ALLEN, #4-40 X .250 + #4 LW"},{"$f":"'Weight sheet'!$C$371","v":"2549 / 19928"},{"$f":"'Weight sheet'!$D$371","v":"-"},{"$f":"'Weight sheet'!$F$371","v":0},{"$f":"'Weight sheet'!$H$371","v":0},{"$f":"$E$389*$D$389","v":0},48.9,{"$f":"$G$389*2.54","v":124.206},{"$f":"$F$389*$H$389","v":0},0,{"$f":"$J$389*$D$389","v":0},{"$f":"$G$389","v":48.9},{"$f":"$L$389*2.54","v":124.206},{"$f":"$K$389*$M$389","v":0},0,{"$f":"$O$389*2.54","v":0},{"$f":"$F$389*$P$389","v":0},{"$f":"$K$389*$P$389","v":0}]
[{"$f":"'Weight sheet'!$B$372","v":"HUB ASSEMBLY, ROTARY MAGNET / SCREW, SET, CUP POINT- ALLEN 10-32 X .188, 18-8 SS"},{"$f":"'Weight sheet'!$C$372","v":"4259021 / 4258345"},{"$f":"'Weight sheet'!$D$372","v":"-"},{"$f":"'Weight sheet'!$F$372","v":0},{"$f":"'Weight sheet'!$H$372","v":0},{"$f":"$E$390*$D$390","v":0},48.9,{"$f":"$G$390*2.54","v":124.206},{"$f":"$F$390*$H$390","v":0},0,{"$f":"$J$390*$D$390","v":0},{"$f":"$G$390","v":48.9},{"$f":"$L$390*2.54","v":124.206},{"$f":"$K$390*$M$390","v":0},-0.4,{"$f":"$O$390*2.54","v":-1.016},{"$f":"$F$390*$P$390","v":0},{"$f":"$K$390*$P$390","v":0}]
[{"$f":"'Weight sheet'!$B$373","v":"PUMP, GEAR, MAGNETIC DRIVE - 5.2 BAR"},{"$f":"'Weight sheet'!$C$373","v":4258747},{"$f":"'Weight sheet'!$D$373","v":"-"},{"$f":"'Weight sheet'!$F$373","v":0},{"$f":"'Weight sheet'!$H$373","v":0},{"$f":"$E$391*$D$391","v":0},48.9,{"$f":"$G$391*2.54","v":124.206},{"$f":"$F$391*$H$391","v":0},0,{"$f":"$J$391*$D$391","v":0},{"$f":"$G$391","v":48.9},{"$f":"$L$391*2.54","v":124.206},{"$f":"$K$391*$M$391","v":0},-0.8,{"$f":"$O$391*2.54","v":-2.032},{"$f":"$F$391*$P$391","v":0},{"$f":"$K$391*$P$391","v":0}]
[{"$f":"'Weight sheet'!$B$375","v":"(2X) FITTING, TUBE, MALE - 90DEG ELBOW 1/4\" TUBE , 1/8\" NPT"},{"$f":"'Weight sheet'!$C$375","v":4251059},{"$f":"'Weight sheet'!$D$375","v":"-"},{"$f":"'Weight sheet'!$F$375","v":0},{"$f":"'Weight sheet'!$H$375","v":0},{"$f":"$E$392*$D$392","v":0},48.9,{"$f":"$G$392*2.54","v":124.206},{"$f":"$F$392*$H$392","v":0},0,{"$f":"$J$392*$D$392","v":0},{"$f":"$G$392","v":48.9},{"$f":"$L$392*2.54","v":124.206},{"$f":"$K$392*$M$392","v":0},-0.9,{"$f":"$O$392*2.54","v":-2.286},{"$f":"$F$392*$P$392","v":0},{"$f":"$K$392*$P$392","v":0}]
[]
["Assy., Hydraulic Reservoir (Standard)",{"$f":"'Weight sheet'!$C$441","v":"4199425 / 2549"},{"$f":"'Weight sheet'!$D$441","v":55388}]
[null,"Subtotal Weight",{"$f":"(SUM($F$398:$F$416))-$F$399+$E$399","v":1144.5000000000005},"gm","diff"]
["Note: Scale Weight is only E295:E313","Scale Weight",{"$f":"'Weight sheet'!$H$379","v":1143},"gm",{"$f":"$C$396-$C$395","v":-1.5000000000004547}]
[]
[{"$f":"'Weight sheet'!$B$380","v":"Piston, Diaphragm"},{"$f":"'Weight sheet'!$C$380","v":4199323},{"$f":"'Weight sheet'!$D$380","v":49811},{"$f":"'Weight sheet'!$F$380","v":1},{"$f":"'Weight sheet'!$H$380","v":137.80000000000001},{"$f":"$E$398*$D$398","v":137.80000000000001},45,{"$f":"$G$398*2.54","v":114.3},{"$f":"$F$398*$H$398","v":15750.54},0,{"$f":"$J$398*$D$398","v":0},{"$f":"$G$398","v":45},{"$f":"$L$398*2.54","v":114.3},{"$f":"$K$398*$M$398","v":0},0,{"$f":"$O$398*2.54","v":0},{"$f":"$F$398*$P$398","v":0},{"$f":"$K$398*$P$398","v":0}]
[{"$f":"'Weight sheet'!$B$381","v":"Diaphragm, Internal (Bellofram)"},{"$f":"'Weight sheet'!$C$381","v":4206402},{"$f":"'Weight sheet'!$D$381","v":56874},{"$f":"'Weight sheet'!$F$381","v":1},{"$f":"'Weight sheet'!$H$381","v":94.5},{"$f":"IF($E$399=0,0,$E$399*$D$399+($C$20*Cal!$D$44*Oil_density))","v":578.74321565410219},{"$f":"45+0.5*1.8*$C$20","v":45.624011260724217},{"$f":"$G$399*2.54","v":115.88498860223952},{"$f":"$F$399*$H$399","v":67067.650949699077},0,{"$f":"$J$399*$D$399","v":0},{"$f":"$G$399","v":45.624011260724217},{"$f":"$L$399*2.54","v":115.88498860223952},{"$f":"$K$399*$M$399","v":0},0,{"$f":"$O$399*2.54","v":0},{"$f":"$F$399*$P$399","v":0},{"$f":"$K$399*$P$399","v":0}]
[{"$f":"'Weight sheet'!$B$382","v":"Sikaflex Adhesive Compound"},{"$f":"'Weight sheet'!$C$382","v":4199233},{"$f":"'Weight sheet'!$D$382","v":55459},{"$f":"'Weight sheet'!$F$382","v":1},{"$f":"'Weight sheet'!$H$382","v":7.7},{"$f":"$E$400*$D$400","v":7.7},45,{"$f":"$G$400*2.54","v":114.3},{"$f":"$F$400*$H$400","v":880.11},0,{"$f":"$J$400*$D$400","v":0},{"$f":"$G$400","v":45},{"$f":"$L$400*2.54","v":114.3},{"$f":"$K$400*$M$400","v":0},0,{"$f":"$O$400*2.54","v":0},{"$f":"$F$400*$P$400","v":0},{"$f":"$K$400*$P$400","v":0}]
[{"$f":"'Weight sheet'!$B$383","v":"Cylinder Head, Diaphragm"},{"$f":"'Weight sheet'!$C$383","v":4199474},{"$f":"'Weight sheet'!$D$383","v":56798},{"$f":"'Weight sheet'!$F$383","v":1},{"$f":"'Weight sheet'!$H$383","v":334.2},{"$f":"$E$401*$D$401","v":334.2},43.9,{"$f":"$G$401*2.54","v":111.506},{"$f":"$F$401*$H$401","v":37265.305199999995},0,{"$f":"$J$401*$D$401","v":0},{"$f":"$G$401","v":43.9},{"$f":"$L$401*2.54","v":111.506},{"$f":"$K$401*$M$401","v":0},0,{"$f":"$O$401*2.54","v":0},{"$f":"$F$401*$P$401","v":0},{"$f":"$K$401*$P$401","v":0}]
[{"$f":"'Weight sheet'!$B$384","v":"Branch Tee, Male, 1/4 tube x 1/8 NPT x 1/4 tube, brass + Plastic plug (X59P4)"},{"$f":"'Weight sheet'!$C$384","v":"4199080 / 4205772"},{"$f":"'Weight sheet'!$D$384","v":"52443 / 52434"},{"$f":"'Weight sheet'!$F$384","v":1},{"$f":"'Weight sheet'!$H$384","v":23.2},{"$f":"$E$402*$D$402","v":23.2},43.24,{"$f":"$G$402*2.54","v":109.82960000000001},{"$f":"$F$402*$H$402","v":2548.0467200000003},0,{"$f":"$J$402*$D$402","v":0},{"$f":"$G$402","v":43.24},{"$f":"$L$402*2.54","v":109.82960000000001},{"$f":"$K$402*$M$402","v":0},-2.39,{"$f":"$O$402*2.54","v":-6.0706000000000007},{"$f":"$F$402*$P$402","v":-140.83792},{"$f":"$K$402*$P$402","v":0}]
[{"$f":"'Weight sheet'!$B$385","v":"Elbow, 1/8 NPT M x 1/8 NPT M, brass"},{"$f":"'Weight sheet'!$C$385","v":4199069},{"$f":"'Weight sheet'!$D$385","v":52426},{"$f":"'Weight sheet'!$F$385","v":1},{"$f":"'Weight sheet'!$H$385","v":26.7},{"$f":"$E$403*$D$403","v":26.7},43.24,{"$f":"$G$403*2.54","v":109.82960000000001},{"$f":"$F$403*$H$403","v":2932.4503200000004},0,{"$f":"$J$403*$D$403","v":0},{"$f":"$G$403","v":43.24},{"$f":"$L$403*2.54","v":109.82960000000001},{"$f":"$K$403*$M$403","v":0},2.39,{"$f":"$O$403*2.54","v":6.0706000000000007},{"$f":"$F$403*$P$403","v":162.08502000000001},{"$f":"$K$403*$P$403","v":0}]
[{"$f":"'Weight sheet'!$B$386","v":"Kepner Chk Valve 404A-1-10"},{"$f":"'Weight sheet'!$C$386","v":4199083},{"$f":"'Weight sheet'!$D$386","v":52447},{"$f":"'Weight sheet'!$F$386","v":1},{"$f":"'Weight sheet'!$H$386","v":25.9},{"$f":"$E$404*$D$404","v":25.9},43.24,{"$f":"$G$404*2.54","v":109.82960000000001},{"$f":"$F$404*$H$404","v":2844.58664},0,{"$f":"$J$404*$D$404","v":0},{"$f":"$G$404","v":43.24},{"$f":"$L$404*2.54","v":109.82960000000001},{"$f":"$K$404*$M$404","v":0},0.8,{"$f":"$O$404*2.54","v":2.032},{"$f":"$F$404*$P$404","v":52.628799999999998},{"$f":"$K$404*$P$404","v":0}]
[{"$f":"'Weight sheet'!$B$387","v":"Elbow, 1/8 npt x 1/8 tube, alum"},{"$f":"'Weight sheet'!$C$387","v":4199070},{"$f":"'Weight sheet'!$D$387","v":52427},{"$f":"'Weight sheet'!$F$387","v":1},{"$f":"'Weight sheet'!$H$387","v":8.6999999999999993},{"$f":"$E$405*$D$405","v":8.6999999999999993},43.24,{"$f":"$G$405*2.54","v":109.82960000000001},{"$f":"$F$405*$H$405","v":955.51751999999999},0,{"$f":"$J$405*$D$405","v":0},{"$f":"$G$405","v":43.24},{"$f":"$L$405*2.54","v":109.82960000000001},{"$f":"$K$405*$M$405","v":0},-0.1,{"$f":"$O$405*2.54","v":-0.254},{"$f":"$F$405*$P$405","v":-2.2098},{"$f":"$K$405*$P$405","v":0}]
[{"$f":"'Weight sheet'!$B$388","v":"Bleed screw, 10-32 x .125 PHMS with seal"},{"$f":"'Weight sheet'!$C$388","v":4210092},{"$f":"'Weight sheet'!$D$388","v":55477},{"$f":"'Weight sheet'!$F$388","v":1},{"$f":"'Weight sheet'!$H$388","v":1.9},{"$f":"$E$406*$D$406","v":1.9},43.24,{"$f":"$G$406*2.54","v":109.82960000000001},{"$f":"$F$406*$H$406","v":208.67624000000001},0,{"$f":"$J$406*$D$406","v":0},{"$f":"$G$406","v":43.24},{"$f":"$L$406*2.54","v":109.82960000000001},{"$f":"$K$406*$M$406","v":0},3,{"$f":"$O$406*2.54","v":7.62},{"$f":"$F$406*$P$406","v":14.478},{"$f":"$K$406*$P$406","v":0}]
[{"$f":"'Weight sheet'!$B$389","v":"Cylinder, Diaphragm"},{"$f":"'Weight sheet'!$C$389","v":4199324},{"$f":"'Weight sheet'!$D$389","v":56943},{"$f":"'Weight sheet'!$F$389","v":1},{"$f":"'Weight sheet'!$H$389","v":422.6},{"$f":"$E$407*$D$407","v":422.6},45.3,{"$f":"$G$407*2.54","v":115.062},{"$f":"$F$407*$H$407","v":48625.201200000003},0,{"$f":"$J$407*$D$407","v":0},{"$f":"$G$407","v":45.3},{"$f":"$L$407*2.54","v":115.062},{"$f":"$K$407*$M$407","v":0},0,{"$f":"$O$407*2.54","v":0},{"$f":"$F$407*$P$407","v":0},{"$f":"$K$407*$P$407","v":0}]
[{"$f":"'Weight sheet'!$B$390","v":"(8x) 5-40 x 3/8 SHCS +#5 LW, head to cylinder"},{"$f":"'Weight sheet'!$C$390","v":"4209126 / 4199125"},{"$f":"'Weight sheet'!$D$390","v":"? / 55225"},{"$f":"'Weight sheet'!$F$390","v":1},{"$f":"'Weight sheet'!$H$390","v":7.4},{"$f":"$E$408*$D$408","v":7.4},43.56,{"$f":"$G$408*2.54","v":110.64240000000001},{"$f":"$F$408*$H$408","v":818.75376000000006},0,{"$f":"$J$408*$D$408","v":0},{"$f":"$G$408","v":43.56},{"$f":"$L$408*2.54","v":110.64240000000001},{"$f":"$K$408*$M$408","v":0},0,{"$f":"$O$408*2.54","v":0},{"$f":"$F$408*$P$408","v":0},{"$f":"$K$408*$P$408","v":0}]
[{"$f":"'Weight sheet'!$B$391","v":"Standoff (starboard)"},{"$f":"'Weight sheet'!$C$391","v":4199418},{"$f":"'Weight sheet'!$D$391","v":55299},{"$f":"'Weight sheet'!$F$391","v":1},{"$f":"'Weight sheet'!$H$391","v":12.5},{"$f":"$E$409*$D$409","v":12.5},47.75,{"$f":"$G$409*2.54","v":121.285},{"$f":"$F$409*$H$409","v":1516.0625},0,{"$f":"$J$409*$D$409","v":0},{"$f":"$G$409","v":47.75},{"$f":"$L$409*2.54","v":121.285},{"$f":"$K$409*$M$409","v":0},2.6,{"$f":"$O$409*2.54","v":6.6040000000000001},{"$f":"$F$409*$P$409","v":82.55},{"$f":"$K$409*$P$409","v":0}]
[{"$f":"'Weight sheet'!$B$392","v":"Standoff (port)"},{"$f":"'Weight sheet'!$C$392","v":4199418},{"$f":"'Weight sheet'!$D$392","v":55299},{"$f":"'Weight sheet'!$F$392","v":1},{"$f":"'Weight sheet'!$H$392","v":12.5},{"$f":"$E$410*$D$410","v":12.5},47.75,{"$f":"$G$410*2.54","v":121.285},{"$f":"$F$410*$H$410","v":1516.0625},0,{"$f":"$J$410*$D$410","v":0},{"$f":"$G$410","v":47.75},{"$f":"$L$410*2.54","v":121.285},{"$f":"$K$410*$M$410","v":0},-2.6,{"$f":"$O$410*2.54","v":-6.6040000000000001},{"$f":"$F$410*$P$410","v":-82.55},{"$f":"$K$410*$P$410","v":0}]
[{"$f":"'Weight sheet'!$B$393","v":"(4x) 6-32 x 3/8 SHCS +#6 LW, standoff to cylinder"},{"$f":"'Weight sheet'!$C$393","v":"4199119 / 4199122"},{"$f":"'Weight sheet'!$D$393","v":"55183 / 55217"},{"$f":"'Weight sheet'!$F$393","v":1},{"$f":"'Weight sheet'!$H$393","v":4.5999999999999996},{"$f":"$E$411*$D$411","v":4.5999999999999996},47.5,{"$f":"$G$411*2.54","v":120.65},{"$f":"$F$411*$H$411","v":554.99},0,{"$f":"$J$411*$D$411","v":0},{"$f":"$G$411","v":47.5},{"$f":"$L$411*2.54","v":120.65},{"$f":"$K$411*$M$411","v":0},0,{"$f":"$O$411*2.54","v":0},{"$f":"$F$411*$P$411","v":0},{"$f":"$K$411*$P$411","v":0}]
[{"$f":"'Weight sheet'!$B$394","v":"(2x) Saddles, mounting, Aft PCB + (4x) 4-40 x 1/4 PHMS"},{"$f":"'Weight sheet'!$C$394","v":"4199410 / 4134111"},{"$f":"'Weight sheet'!$D$394","v":"52373 / 55257"},{"$f":"'Weight sheet'!$F$394","v":1},{"$f":"'Weight sheet'!$H$394","v":5},{"$f":"$E$412*$D$412","v":5},45.5,{"$f":"$G$412*2.54","v":115.57000000000001},{"$f":"$F$412*$H$412","v":577.85},0,{"$f":"$J$412*$D$412","v":0},{"$f":"$G$412","v":45.5},{"$f":"$L$412*2.54","v":115.57000000000001},{"$f":"$K$412*$M$412","v":0},3.2,{"$f":"$O$412*2.54","v":8.1280000000000001},{"$f":"$F$412*$P$412","v":40.64},{"$f":"$K$412*$P$412","v":0}]
[{"$f":"'Weight sheet'!$B$395","v":"(2x) Saddles, mounting, C PCB + (4x) 4-40 x 1/4 PHMS"},{"$f":"'Weight sheet'!$C$395","v":"4199345 / 4134111"},{"$f":"'Weight sheet'!$D$395","v":"49888 / 55257"},{"$f":"'Weight sheet'!$F$395","v":1},{"$f":"'Weight sheet'!$H$395","v":6.4},{"$f":"$E$413*$D$413","v":6.4},45.5,{"$f":"$G$413*2.54","v":115.57000000000001},{"$f":"$F$413*$H$413","v":739.64800000000014},0,{"$f":"$J$413*$D$413","v":0},{"$f":"$G$413","v":45.5},{"$f":"$L$413*2.54","v":115.57000000000001},{"$f":"$K$413*$M$413","v":0},1.5,{"$f":"$O$413*2.54","v":3.81},{"$f":"$F$413*$P$413","v":24.384},{"$f":"$K$413*$P$413","v":0}]
[{"$f":"'Weight sheet'!$B$396","v":"(2x) Saddles, mounting, T PCB + (4x) 4-40 x 1/4 PHMS"},{"$f":"'Weight sheet'!$C$396","v":"4199345 / 4134111"},{"$f":"'Weight sheet'!$D$396","v":"49888 / 55257"},{"$f":"'Weight sheet'!$F$396","v":1},{"$f":"'Weight sheet'!$H$396","v":6.5},{"$f":"$E$414*$D$414","v":6.5},45.5,{"$f":"$G$414*2.54","v":115.57000000000001},{"$f":"$F$414*$H$414","v":751.20500000000004},0,{"$f":"$J$414*$D$414","v":0},{"$f":"$G$414","v":45.5},{"$f":"$L$414*2.54","v":115.57000000000001},{"$f":"$K$414*$M$414","v":0},-1.5,{"$f":"$O$414*2.54","v":-3.81},{"$f":"$F$414*$P$414","v":-24.765000000000001},{"$f":"$K$414*$P$414","v":0}]
[{"$f":"'Weight sheet'!$B$397","v":"(2x) Saddles, mounting, O2 PCB + (4x) 4-40 x 1/4 PHMS (only used with SBE 43f)"},{"$f":"'Weight sheet'!$C$397","v":"4199345 / 4134111"},{"$f":"'Weight sheet'!$D$397","v":"49888 / 55257"},{"$f":"'Weight sheet'!$F$397","v":1},{"$f":"'Weight sheet'!$H$397","v":6.4},{"$f":"$E$415*$D$415","v":6.4},45.5,{"$f":"$G$415*2.54","v":115.57000000000001},{"$f":"$F$415*$H$415","v":739.64800000000014},0,{"$f":"$J$415*$D$415","v":0},{"$f":"$G$415","v":45.5},{"$f":"$L$415*2.54","v":115.57000000000001},{"$f":"$K$415*$M$415","v":0},-3.2,{"$f":"$O$415*2.54","v":-8.1280000000000001},{"$f":"$F$415*$P$415","v":-52.019200000000005},{"$f":"$K$415*$P$415","v":0}]
[{"$f":"'Weight sheet'!$B$398","v":"Ball Bearing joint / ring retaining spiral / stud mount / ball swivel ring"},{"$f":"'Weight sheet'!$C$398","v":"4205785 / 4205787 / 4205808 / 4205809"},{"$f":"'Weight sheet'!$D$398","v":0},{"$f":"'Weight sheet'!$F$398","v":0},{"$f":"'Weight sheet'!$H$398","v":0},{"$f":"$E$416*$D$416","v":0},43.9,{"$f":"$G$416*2.54","v":111.506},{"$f":"$F$416*$H$416","v":0},0,0,{"$f":"$G$416","v":43.9},{"$f":"$L$416*2.54","v":111.506},{"$f":"$K$416*$M$416","v":0},0,{"$f":"$O$416*2.54","v":0},{"$f":"$F$416*$P$416","v":0},{"$f":"$K$416*$P$416","v":0}]
["Weigh Hydraulic res. Assy, then Oil fill & add sub-assy fasteners"]
[]
[]
["Assy., Hydraulic Reservoir (Enhanced)",{"$f":"'Weight sheet'!$C$401","v":4199397},{"$f":"'Weight sheet'!$D$401","v":"-"}]
[null,"Subtotal Weight",{"$f":"(SUM($F$423:$F$446))-$F$424+$E$424","v":0},"gm","diff"]
["Note: Scale Weight is only E291:E314","Scale Weight",{"$f":"'Weight sheet'!$H$403","v":0},"gm",{"$f":"$C$422-$C$421","v":0}]
[{"$f":"'Weight sheet'!$B$404","v":"PISTON DIAPHRAGM"},{"$f":"'Weight sheet'!$C$404","v":4199323},{"$f":"'Weight sheet'!$D$404","v":49811},{"$f":"'Weight sheet'!$F$404","v":0},{"$f":"'Weight sheet'!$H$404","v":0},{"$f":"$E$423*$D$423","v":0},45,{"$f":"$G$423*2.54","v":114.3},{"$f":"$F$423*$H$423","v":0},0,{"$f":"$J$423*$D$423","v":0},{"$f":"$G$423","v":45},{"$f":"$L$423*2.54","v":114.3},{"$f":"$K$423*$M$423","v":0},0,{"$f":"$O$423*2.54","v":0},{"$f":"$F$423*$P$423","v":0},{"$f":"$K$423*$P$423","v":0}]
[{"$f":"'Weight sheet'!$B$405","v":"DIAPHRAGM, ROLLING NITRILE (BELLOWFRAM)"},{"$f":"'Weight sheet'!$C$405","v":4206402},{"$f":"'Weight sheet'!$D$405","v":56874},{"$f":"'Weight sheet'!$F$405","v":0},{"$f":"'Weight sheet'!$H$405","v":0},{"$f":"IF($E$424=0,0,$E$424*$D$424+($C$20*Cal!$D$44*Oil_density))","v":0},{"$f":"45+0.5*1.8*$C$20","v":45.624011260724217},{"$f":"$G$424*2.54","v":115.88498860223952},{"$f":"$F$424*$H$424","v":0},0,{"$f":"$J$424*$D$424","v":0},{"$f":"$G$424","v":45.624011260724217},{"$f":"$L$424*2.54","v":115.88498860223952},{"$f":"$K$424*$M$424","v":0},0,{"$f":"$O$424*2.54","v":0},{"$f":"$F$424*$P$424","v":0},{"$f":"$K$424*$P$424","v":0}]
[{"$f":"'Weight sheet'!$B$406","v":"ADHESIVE, STRUCTURAL - POLYURETHANE, SIKAFLEX 292"},{"$f":"'Weight sheet'!$C$406","v":4199233},{"$f":"'Weight sheet'!$D$406","v":55459},{"$f":"'Weight sheet'!$F$406","v":0},{"$f":"'Weight sheet'!$H$406","v":0},{"$f":"$E$425*$D$425","v":0},45,{"$f":"$G$425*2.54","v":114.3},{"$f":"$F$425*$H$425","v":0},0,{"$f":"$J$425*$D$425","v":0},{"$f":"$G$425","v":45},{"$f":"$L$425*2.54","v":114.3},{"$f":"$K$425*$M$425","v":0},0,{"$f":"$O$425*2.54","v":0},{"$f":"$F$425*$P$425","v":0},{"$f":"$K$425*$P$425","v":0}]
[{"$f":"'Weight sheet'!$B$407","v":"CYLINDER HEAD, SWIVEL MOUNT"},{"$f":"'Weight sheet'!$C$407","v":4261356},{"$f":"'Weight sheet'!$D$407","v":"-"},{"$f":"'Weight sheet'!$F$407","v":0},{"$f":"'Weight sheet'!$H$407","v":0},{"$f":"$E$426*$D$426","v":0},43.9,{"$f":"$G$426*2.54","v":111.506},{"$f":"$F$426*$H$426","v":0},0,{"$f":"$J$426*$D$426","v":0},{"$f":"$G$426","v":43.9},{"$f":"$L$426*2.54","v":111.506},{"$f":"$K$426*$M$426","v":0},0,{"$f":"$O$426*2.54","v":0},{"$f":"$F$426*$P$426","v":0},{"$f":"$K$426*$P$426","v":0}]
[{"$f":"'Weight sheet'!$B$408","v":"FITTING, TUBE, MALE - BRANCH TEE 2 X 1/4\" TUBE , 1/8\" NPT / FITTING, TUBE, PLUG - 1/4\" TUBE, NYL, RED"},{"$f":"'Weight sheet'!$C$408","v":"4250878 / 4251094"},{"$f":"'Weight sheet'!$D$408","v":"-"},{"$f":"'Weight sheet'!$F$408","v":0},{"$f":"'Weight sheet'!$H$408","v":0},{"$f":"$E$427*$D$427","v":0},43.24,{"$f":"$G$427*2.54","v":109.82960000000001},{"$f":"$F$427*$H$427","v":0},0,{"$f":"$J$427*$D$427","v":0},{"$f":"$G$427","v":43.24},{"$f":"$L$427*2.54","v":109.82960000000001},{"$f":"$K$427*$M$427","v":0},-2.39,{"$f":"$O$427*2.54","v":-6.0706000000000007},{"$f":"$F$427*$P$427","v":0},{"$f":"$K$427*$P$427","v":0}]
[{"$f":"'Weight sheet'!$B$409","v":"FITTING, PIPE - 90 DEG ELBOW 2 x 1/8\" NPT, M, BRASS"},{"$f":"'Weight sheet'!$C$409","v":4199069},{"$f":"'Weight sheet'!$D$409","v":52426},{"$f":"'Weight sheet'!$F$410","v":0},{"$f":"'Weight sheet'!$H$410","v":0},{"$f":"$E$428*$D$428","v":0},43.24,{"$f":"$G$428*2.54","v":109.82960000000001},{"$f":"$F$428*$H$428","v":0},0,{"$f":"$J$428*$D$428","v":0},{"$f":"$G$428","v":43.24},{"$f":"$L$428*2.54","v":109.82960000000001},{"$f":"$K$428*$M$428","v":0},2.39,{"$f":"$O$428*2.54","v":6.0706000000000007},{"$f":"$F$428*$P$428","v":0},{"$f":"$K$428*$P$428","v":0}]
[{"$f":"'Weight sheet'!$B$410","v":"VALVE, CHECK, INLINE - 200 PSI CRACK, 2 x 1/8\" NPT, F, ALUM"},{"$f":"'Weight sheet'!$C$410","v":4282752},{"$f":"'Weight sheet'!$D$410","v":"-"},{"$f":"'Weight sheet'!$F$411","v":0},{"$f":"'Weight sheet'!$H$411","v":0},{"$f":"$E$429*$D$429","v":0},43.24,{"$f":"$G$429*2.54","v":109.82960000000001},{"$f":"$F$429*$H$429","v":0},0,{"$f":"$J$429*$D$429","v":0},{"$f":"$G$429","v":43.24},{"$f":"$L$429*2.54","v":109.82960000000001},{"$f":"$K$429*$M$429","v":0},0.8,{"$f":"$O$429*2.54","v":2.032},{"$f":"$F$429*$P$429","v":0},{"$f":"$K$429*$P$429","v":0}]
[{"$f":"'Weight sheet'!$B$411","v":"FITTING, TUBE, MALE - 90DEG ELBOW, 1/8\" TUBE , 1/8\" NPT, M "},{"$f":"'Weight sheet'!$C$411","v":4251095},{"$f":"'Weight sheet'!$D$411","v":"-"},{"$f":"'Weight sheet'!$F$409","v":0},{"$f":"'Weight sheet'!$H$409","v":0},{"$f":"$E$430*$D$430","v":0},43.24,{"$f":"$G$430*2.54","v":109.82960000000001},{"$f":"$F$430*$H$430","v":0},0,{"$f":"$J$430*$D$430","v":0},{"$f":"$G$430","v":43.24},{"$f":"$L$430*2.54","v":109.82960000000001},{"$f":"$K$430*$M$430","v":0},-0.1,{"$f":"$O$430*2.54","v":-0.254},{"$f":"$F$430*$P$430","v":0},{"$f":"$K$430*$P$430","v":0}]
[{"$f":"'Weight sheet'!$B$412","v":"SCREW, PAN HEAD - PHILLIPS, #8-32 x .250, 18-8 SS, SEALING"},{"$f":"'Weight sheet'!$C$412","v":4262362},{"$f":"'Weight sheet'!$D$412","v":"-"},{"$f":"'Weight sheet'!$F$412","v":0},{"$f":"'Weight sheet'!$H$412","v":0},{"$f":"$E$431*$D$431","v":0},43.24,{"$f":"$G$431*2.54","v":109.82960000000001},{"$f":"$F$431*$H$431","v":0},0,{"$f":"$J$431*$D$431","v":0},{"$f":"$G$431","v":43.24},{"$f":"$L$431*2.54","v":109.82960000000001},{"$f":"$K$431*$M$431","v":0},3,{"$f":"$O$431*2.54","v":7.62},{"$f":"$F$431*$P$431","v":0},{"$f":"$K$431*$P$431","v":0}]
[{"$f":"'Weight sheet'!$B$413","v":"CYLINDER, DIAPHRAGM"},{"$f":"'Weight sheet'!$C$413","v":4261328},{"$f":"'Weight sheet'!$D$413","v":"-"},{"$f":"'Weight sheet'!$F$413","v":0},{"$f":"'Weight sheet'!$H$413","v":0},{"$f":"$E$432*$D$432","v":0},45.3,{"$f":"$G$432*2.54","v":115.062},{"$f":"$F$432*$H$432","v":0},0,{"$f":"$J$432*$D$432","v":0},{"$f":"$G$432","v":45.3},{"$f":"$L$432*2.54","v":115.062},{"$f":"$K$432*$M$432","v":0},0,{"$f":"$O$432*2.54","v":0},{"$f":"$F$432*$P$432","v":0},{"$f":"$K$432*$P$432","v":0}]
[{"$f":"'Weight sheet'!$B$414","v":"(8X) SCREW, SOCKET HEAD - ALLEN, #6-32 x .500,+ #6 LW"},{"$f":"'Weight sheet'!$C$414","v":"4199111 / 4199122"},{"$f":"'Weight sheet'!$D$414","v":"-"},{"$f":"'Weight sheet'!$F$414","v":0},{"$f":"'Weight sheet'!$H$414","v":0},{"$f":"$E$433*$D$433","v":0},43.56,{"$f":"$G$433*2.54","v":110.64240000000001},{"$f":"$F$433*$H$433","v":0},0,{"$f":"$J$433*$D$433","v":0},{"$f":"$G$433","v":43.56},{"$f":"$L$433*2.54","v":110.64240000000001},{"$f":"$K$433*$M$433","v":0},0,{"$f":"$O$433*2.54","v":0},{"$f":"$F$433*$P$433","v":0},{"$f":"$K$433*$P$433","v":0}]
[{"$f":"'Weight sheet'!$B$415","v":"STANDOFF, RESERVOIR CYLINDER (STARBOARD)"},{"$f":"'Weight sheet'!$C$415","v":4199418},{"$f":"'Weight sheet'!$D$415","v":55299},{"$f":"'Weight sheet'!$F$415","v":0},{"$f":"'Weight sheet'!$H$415","v":0},{"$f":"$E$434*$D$434","v":0},47.75,{"$f":"$G$434*2.54","v":121.285},{"$f":"$F$434*$H$434","v":0},0,{"$f":"$J$434*$D$434","v":0},{"$f":"$G$434","v":47.75},{"$f":"$L$434*2.54","v":121.285},{"$f":"$K$434*$M$434","v":0},2.6,{"$f":"$O$434*2.54","v":6.6040000000000001},{"$f":"$F$434*$P$434","v":0},{"$f":"$K$434*$P$434","v":0}]
[{"$f":"'Weight sheet'!$B$416","v":"STANDOFF, RESERVOIR CYLINDER (PORT)"},{"$f":"'Weight sheet'!$C$416","v":4199418},{"$f":"'Weight sheet'!$D$416","v":55299},{"$f":"'Weight sheet'!$F$416","v":0},{"$f":"'Weight sheet'!$H$416","v":0},{"$f":"$E$435*$D$435","v":0},47.75,{"$f":"$G$435*2.54","v":121.285},{"$f":"$F$435*$H$435","v":0},0,{"$f":"$J$435*$D$435","v":0},{"$f":"$G$435","v":47.75},{"$f":"$L$435*2.54","v":121.285},{"$f":"$K$435*$M$435","v":0},-2.6,{"$f":"$O$435*2.54","v":-6.6040000000000001},{"$f":"$F$435*$P$435","v":0},{"$f":"$K$435*$P$435","v":0}]
[{"$f":"'Weight sheet'!$B$417","v":"(4X) SCREW, SOCKET HEAD - ALLEN, #6-32 x .500 + #6 LW"},{"$f":"'Weight sheet'!$C$417","v":"4199111 / 4199122"},{"$f":"'Weight sheet'!$D$417","v":"-"},{"$f":"'Weight sheet'!$F$417","v":0},{"$f":"'Weight sheet'!$H$417","v":0},{"$f":"$E$436*$D$436","v":0},47.5,{"$f":"$G$436*2.54","v":120.65},{"$f":"$F$436*$H$436","v":0},0,{"$f":"$J$436*$D$436","v":0},{"$f":"$G$436","v":47.5},{"$f":"$L$436*2.54","v":120.65},{"$f":"$K$436*$M$436","v":0},0,{"$f":"$O$436*2.54","v":0},{"$f":"$F$436*$P$436","v":0},{"$f":"$K$436*$P$436","v":0}]
[{"$f":"'Weight sheet'!$B$418","v":"(2x) MOUNT, SADDLE, TERMINAL PCBA "},{"$f":"'Weight sheet'!$C$418","v":4199410},{"$f":"'Weight sheet'!$D$418","v":52373},{"$f":"'Weight sheet'!$F$418","v":0},{"$f":"'Weight sheet'!$H$418","v":0},{"$f":"$E$437*$D$437","v":0},45.5,{"$f":"$G$437*2.54","v":115.57000000000001},{"$f":"$F$437*$H$437","v":0},0,{"$f":"$J$437*$D$437","v":0},{"$f":"$G$437","v":45.5},{"$f":"$L$437*2.54","v":115.57000000000001},{"$f":"$K$437*$M$437","v":0},3.2,{"$f":"$O$437*2.54","v":8.1280000000000001},{"$f":"$F$437*$P$437","v":0},{"$f":"$K$437*$P$437","v":0}]
[{"$f":"'Weight sheet'!$B$419","v":"(2X) MOUNT, SADDLE, PCBA (CONDUCTIVITY)"},{"$f":"'Weight sheet'!$C$419","v":4199345},{"$f":"'Weight sheet'!$D$419","v":49888},{"$f":"'Weight sheet'!$F$419","v":0},{"$f":"'Weight sheet'!$H$419","v":0},{"$f":"$E$438*$D$438","v":0},45.5,{"$f":"$G$438*2.54","v":115.57000000000001},{"$f":"$F$438*$H$438","v":0},0,{"$f":"$J$438*$D$438","v":0},{"$f":"$G$438","v":45.5},{"$f":"$L$438*2.54","v":115.57000000000001},{"$f":"$K$438*$M$438","v":0},1.5,{"$f":"$O$438*2.54","v":3.81},{"$f":"$F$438*$P$438","v":0},{"$f":"$K$438*$P$438","v":0}]
[{"$f":"'Weight sheet'!$B$420","v":"(2X) MOUNT, SADDLE, PCBA (TEMP)"},{"$f":"'Weight sheet'!$C$420","v":4199345},{"$f":"'Weight sheet'!$D$420","v":49888},{"$f":"'Weight sheet'!$F$420","v":0},{"$f":"'Weight sheet'!$H$420","v":0},{"$f":"$E$439*$D$439","v":0},45.5,{"$f":"$G$439*2.54","v":115.57000000000001},{"$f":"$F$439*$H$439","v":0},0,{"$f":"$J$439*$D$439","v":0},{"$f":"$G$439","v":45.5},{"$f":"$L$439*2.54","v":115.57000000000001},{"$f":"$K$439*$M$439","v":0},-1.5,{"$f":"$O$439*2.54","v":-3.81},{"$f":"$F$439*$P$439","v":0},{"$f":"$K$439*$P$439","v":0}]
[{"$f":"'Weight sheet'!$B$421","v":"(2X) MOUNT, SADDLE, PCBA (OXYGEN)"},{"$f":"'Weight sheet'!$C$421","v":4199345},{"$f":"'Weight sheet'!$D$421","v":49888},{"$f":"'Weight sheet'!$F$421","v":0},{"$f":"'Weight sheet'!$H$421","v":0},{"$f":"$E$440*$D$440","v":0},45.5,{"$f":"$G$440*2.54","v":115.57000000000001},{"$f":"$F$440*$H$440","v":0},0,{"$f":"$J$440*$D$440","v":0},{"$f":"$G$440","v":45.5},{"$f":"$L$440*2.54","v":115.57000000000001},{"$f":"$K$440*$M$440","v":0},-3.2,{"$f":"$O$440*2.54","v":-8.1280000000000001},{"$f":"$F$440*$P$440","v":0},{"$f":"$K$440*$P$440","v":0}]
[{"$f":"'Weight sheet'!$B$422","v":"BRACKET, BALSTON FILTER"},{"$f":"'Weight sheet'!$C$422","v":4275539},{"$f":"'Weight sheet'!$D$422","v":"-"},{"$f":"'Weight sheet'!$F$422","v":0},{"$f":"'Weight sheet'!$H$422","v":0},{"$f":"$E$441*$D$441","v":0},43.8,{"$f":"$G$441*2.54","v":111.252},{"$f":"$F$441*$H$441","v":0},0,{"$f":"$J$441*$D$441","v":0},{"$f":"$G$441","v":43.8},{"$f":"$L$441*2.54","v":111.252},{"$f":"$K$441*$M$441","v":0},-2,{"$f":"$O$441*2.54","v":-5.08},{"$f":"$F$441*$P$441","v":0},{"$f":"$K$441*$P$441","v":0}]
[{"$f":"'Weight sheet'!$B$423","v":"FILTER, INLINE - 1/4\" TUBE 25um, 125 PSI, GLASS FIBER, PVDF"},{"$f":"'Weight sheet'!$C$423","v":4199068},{"$f":"'Weight sheet'!$D$423","v":"-"},{"$f":"'Weight sheet'!$F$423","v":0},{"$f":"'Weight sheet'!$H$423","v":0},{"$f":"$E$442*$D$442","v":0},43.5,{"$f":"$G$442*2.54","v":110.49},{"$f":"$F$442*$H$442","v":0},0,{"$f":"$J$442*$D$442","v":0},{"$f":"$G$442","v":43.5},{"$f":"$L$442*2.54","v":110.49},{"$f":"$K$442*$M$442","v":0},-2,{"$f":"$O$442*2.54","v":-5.08},{"$f":"$F$442*$P$442","v":0},{"$f":"$K$442*$P$442","v":0}]
[{"$f":"'Weight sheet'!$B$424","v":"CABLE TIE, 2.0IN BUNDLE - 8.75 LG, NYL, BLK, UV"},{"$f":"'Weight sheet'!$C$424","v":4199110},{"$f":"'Weight sheet'!$D$424","v":"-"},{"$f":"'Weight sheet'!$F$424","v":0},{"$f":"'Weight sheet'!$H$424","v":0},{"$f":"$E$443*$D$443","v":0},43.5,{"$f":"$G$443*2.54","v":110.49},{"$f":"$F$443*$H$443","v":0},0,{"$f":"$J$443*$D$443","v":0},{"$f":"$G$443","v":43.5},{"$f":"$L$443*2.54","v":110.49},{"$f":"$K$443*$M$443","v":0},-2,{"$f":"$O$443*2.54","v":-5.08},{"$f":"$F$443*$P$443","v":0},{"$f":"$K$443*$P$443","v":0}]
[{"$f":"'Weight sheet'!$B$425","v":"FITTING, TUBE, MALE - 90DEG ELBOW, 1/4\" TUBE, 1/8\" NPT M "},{"$f":"'Weight sheet'!$C$425","v":4251059},{"$f":"'Weight sheet'!$D$425","v":"-"},{"$f":"'Weight sheet'!$F$425","v":0},{"$f":"'Weight sheet'!$H$425","v":0},{"$f":"$E$444*$D$444","v":0},43.5,{"$f":"$G$444*2.54","v":110.49},{"$f":"$F$444*$H$444","v":0},0,{"$f":"$J$444*$D$444","v":0},{"$f":"$G$444","v":43.5},{"$f":"$L$444*2.54","v":110.49},{"$f":"$K$444*$M$444","v":0},-2,{"$f":"$O$444*2.54","v":-5.08},{"$f":"$F$444*$P$444","v":0},{"$f":"$K$444*$P$444","v":0}]
[{"$f":"'Weight sheet'!$B$426","v":"FITTING, TUBE, STRAIGHT - COUPLING, 2 x 1/4\" TUBE"},{"$f":"'Weight sheet'!$C$426","v":4251092},{"$f":"'Weight sheet'!$D$426","v":"-"},{"$f":"'Weight sheet'!$F$426","v":0},{"$f":"'Weight sheet'!$H$426","v":0},{"$f":"$E$445*$D$445","v":0},43.5,{"$f":"$G$445*2.54","v":110.49},{"$f":"$F$445*$H$445","v":0},0,{"$f":"$J$445*$D$445","v":0},{"$f":"$G$445","v":43.5},{"$f":"$L$445*2.54","v":110.49},{"$f":"$K$445*$M$445","v":0},-2,{"$f":"$O$445*2.54","v":-5.08},{"$f":"$F$445*$P$445","v":0},{"$f":"$K$445*$P$445","v":0}]
[{"$f":"'Weight sheet'!$B$427","v":"STUD, MOUNT, SWIVEL - TTI / BEARING, BALL JOINT, SWIVEL / RING, RETAINER, BALL JOINT - TTI / RING, RETAINING, INTERNAL - SPIRAL"},{"$f":"'Weight sheet'!$C$427","v":"4205808 / 4205785 / 4205809 / 4205787"},{"$f":"'Weight sheet'!$D$427","v":"-"},{"$f":"'Weight sheet'!$F$427","v":0},{"$f":"'Weight sheet'!$H$427","v":0},{"$f":"$E$446*$D$446","v":0},43.9,{"$f":"$G$446*2.54","v":111.506},{"$f":"$F$446*$H$446","v":0},0,0,{"$f":"$G$446","v":43.9},{"$f":"$L$446*2.54","v":111.506},{"$f":"$K$446*$M$446","v":0},0,{"$f":"$O$446*2.54","v":0},{"$f":"$F$446*$P$446","v":0},{"$f":"$K$446*$P$446","v":0}]
["Weigh Hydraulic res. Assy, then Oil fill & add sub-assy fasteners"]
[{"$f":"'Weight sheet'!$B$430","v":"ASSY, CABLE, LINEAR TRANSDUCER, VBD POSITION A - A1W20 / SPRING, COMPRESSION / KNOB, ROD END / CLAMP, LINEAR TRANSDUCER, POSTION VBD / SCREW, SOCKET HEAD, ALLEN #6-32 X .500, 18-8 SS"},{"$f":"'Weight sheet'!$C$430","v":"4199368 / 4198939 / 4199123"},{"$f":"'Weight sheet'!$D$430","v":"-"},{"$f":"'Weight sheet'!$F$430","v":1},{"$f":"'Weight sheet'!$H$430","v":41.1},{"$f":"$E$448*$D$448","v":41.1},47.75,{"$f":"$G$448*2.54","v":121.285},{"$f":"$F$448*$H$448","v":4984.8135000000002},0,{"$f":"$J$448*$D$448","v":0},{"$f":"$G$448","v":47.75},{"$f":"$L$448*2.54","v":121.285},{"$f":"$K$448*$M$448","v":0},2.5,{"$f":"$O$448*2.54","v":6.35},{"$f":"$F$448*$P$448","v":260.98500000000001},{"$f":"$K$448*$P$448","v":0}]
[{"$f":"'Weight sheet'!$B$432","v":"ASSY, CABLE, LINEAR TRANSDUCER, VBD POSITION B - A1W21 / SPRING, COMPRESSION / KNOB, ROD END / CLAMP, LINEAR TRANSDUCER, POSTION VBD / SCREW, SOCKET HEAD, ALLEN #6-32 X .500, 18-8 SS"},{"$f":"'Weight sheet'!$C$432","v":"4199369 / 4198939 / 4199123"},{"$f":"'Weight sheet'!$D$432","v":"-"},{"$f":"'Weight sheet'!$F$432","v":1},{"$f":"'Weight sheet'!$H$432","v":38.700000000000003},{"$f":"$E$449*$D$449","v":38.700000000000003},47.75,{"$f":"$G$449*2.54","v":121.285},{"$f":"$F$449*$H$449","v":4693.7295000000004},0,{"$f":"$J$449*$D$449","v":0},{"$f":"$G$449","v":47.75},{"$f":"$L$449*2.54","v":121.285},{"$f":"$K$449*$M$449","v":0},2.5,{"$f":"$O$449*2.54","v":6.35},{"$f":"$F$449*$P$449","v":245.745},{"$f":"$K$449*$P$449","v":0}]
[{"$f":"'Weight sheet'!$B$433","v":"(2X) SCREW, SOCKET HEAD - ALLEN, #6-32 x .500, 18-8 SS"},{"$f":"'Weight sheet'!$C$433","v":4199111},{"$f":"'Weight sheet'!$D$433","v":55183},{"$f":"'Weight sheet'!$F$433","v":1},{"$f":"'Weight sheet'!$H$433","v":2.1},{"$f":"$E$450*$D$450","v":2.1},48.28,{"$f":"$G$450*2.54","v":122.63120000000001},{"$f":"$F$450*$H$450","v":257.52552000000003},0,{"$f":"$J$450*$D$450","v":0},{"$f":"$G$450","v":48.28},{"$f":"$L$450*2.54","v":122.63120000000001},{"$f":"$K$450*$M$450","v":0},0,{"$f":"$O$450*2.54","v":0},{"$f":"$F$450*$P$450","v":0},{"$f":"$K$450*$P$450","v":0}]
[{"$f":"'Weight sheet'!$B$434","v":"(4X) SCREW, SOCKET HEAD - ALLEN, #6-32 x .500 + #6 LW"},{"$f":"'Weight sheet'!$C$434","v":"4199111 / 4199122"},{"$f":"'Weight sheet'!$D$434","v":55183},{"$f":"'Weight sheet'!$F$434","v":1},{"$f":"'Weight sheet'!$H$434","v":5.4},{"$f":"$E$451*$D$451","v":5.4},47.9,{"$f":"$G$451*2.54","v":121.666},{"$f":"$F$451*$H$451","v":656.99639999999999},0,{"$f":"$J$451*$D$451","v":0},{"$f":"$G$451","v":47.9},{"$f":"$L$451*2.54","v":121.666},{"$f":"$K$451*$M$451","v":0},0,{"$f":"$O$451*2.54","v":0},{"$f":"$F$451*$P$451","v":0},{"$f":"$K$451*$P$451","v":0}]
["aft endcap electronic parts - mount with CT sail"]
[{"$f":"'Weight sheet'!$B$436","v":"PCBA, AFT TERMINAL + (4X) #4-40  x .250 SHCS"},{"$f":"'Weight sheet'!$C$436","v":"4199419 / 2549"},{"$f":"'Weight sheet'!$D$436","v":55302},{"$f":"'Weight sheet'!$F$436","v":1},{"$f":"'Weight sheet'!$H$436","v":25.1},{"$f":"$E$453*$D$453","v":25.1},45.5,{"$f":"$G$453*2.54","v":115.57000000000001},{"$f":"$F$453*$H$453","v":2900.8070000000002},0,{"$f":"$J$453*$D$453","v":0},{"$f":"$G$453","v":45.5},{"$f":"$L$453*2.54","v":115.57000000000001},{"$f":"$K$453*$M$453","v":0},3.4,{"$f":"$O$453*2.54","v":8.6359999999999992},{"$f":"$F$453*$P$453","v":216.7636},{"$f":"$K$453*$P$453","v":0}]
[{"$f":"'Weight sheet'!$B$438","v":"PCBA, CONDUCTIVITY SENSOR (SEABIRD) + (4X) #4-40 x .250 SHCS"},{"$f":"'Weight sheet'!$C$438","v":"4199423 / 2549"},{"$f":"'Weight sheet'!$D$438","v":55385},{"$f":"'Weight sheet'!$F$438","v":1},{"$f":"'Weight sheet'!$H$438","v":33.700000000000003},{"$f":"$E$454*$D$454","v":33.700000000000003},45.5,{"$f":"$G$454*2.54","v":115.57000000000001},{"$f":"$F$454*$H$454","v":3894.7090000000007},0,{"$f":"$J$454*$D$454","v":0},{"$f":"$G$454","v":45.5},{"$f":"$L$454*2.54","v":115.57000000000001},{"$f":"$K$454*$M$454","v":0},1.7,{"$f":"$O$454*2.54","v":4.3179999999999996},{"$f":"$F$454*$P$454","v":145.51660000000001},{"$f":"$K$454*$P$454","v":0}]
[{"$f":"'Weight sheet'!$B$439","v":"ASSY, CABLE CONDUCTIVITY ELECTRONICS - A1W26"},{"$f":"'Weight sheet'!$C$439","v":4199373},{"$f":"'Weight sheet'!$D$439","v":52261},{"$f":"'Weight sheet'!$F$439","v":1},{"$f":"'Weight sheet'!$H$439","v":3.3},{"$f":"$E$455*$D$455","v":3.3},44.4,{"$f":"$G$455*2.54","v":112.776},{"$f":"$F$455*$H$455","v":372.16079999999999},0,{"$f":"$J$455*$D$455","v":0},{"$f":"$G$455","v":44.4},{"$f":"$L$455*2.54","v":112.776},{"$f":"$K$455*$M$455","v":0},1.5,{"$f":"$O$455*2.54","v":3.81},{"$f":"$F$455*$P$455","v":12.572999999999999},{"$f":"$K$455*$P$455","v":0}]
[{"$f":"'Weight sheet'!$B$440","v":"COVER, PCBA, COND. SENSOR /   (4x) SCREW, BH #2-56 x .25 , 18-8 SS"},{"$f":"'Weight sheet'!$C$440","v":"4199344 / 4199124"},{"$f":"'Weight sheet'!$D$440","v":"49887 / 55221"},{"$f":"'Weight sheet'!$F$440","v":1},{"$f":"'Weight sheet'!$H$440","v":20.3},{"$f":"$E$456*$D$456","v":20.3},45.5,{"$f":"$G$456*2.54","v":115.57000000000001},{"$f":"$F$456*$H$456","v":2346.0710000000004},0,{"$f":"$J$456*$D$456","v":0},{"$f":"$G$456","v":45.5},{"$f":"$L$456*2.54","v":115.57000000000001},{"$f":"$K$456*$M$456","v":0},1.9,{"$f":"$O$456*2.54","v":4.8259999999999996},{"$f":"$F$456*$P$456","v":97.967799999999997},{"$f":"$K$456*$P$456","v":0}]
[{"$f":"'Weight sheet'!$B$441","v":"PCBA, TEMPERATURE SENSOR (SEABIRD) + (4X) #4-40 x .250 SHCS"},{"$f":"'Weight sheet'!$C$441","v":"4199425 / 2549"},{"$f":"'Weight sheet'!$D$441","v":55388},{"$f":"'Weight sheet'!$F$441","v":1},{"$f":"'Weight sheet'!$H$441","v":22.3},{"$f":"$E$457*$D$457","v":22.3},45.5,{"$f":"$G$457*2.54","v":115.57000000000001},{"$f":"$F$457*$H$457","v":2577.2110000000002},0,{"$f":"$J$457*$D$457","v":0},{"$f":"$G$457","v":45.5},{"$f":"$L$457*2.54","v":115.57000000000001},{"$f":"$K$457*$M$457","v":0},-1.7,{"$f":"$O$457*2.54","v":-4.3179999999999996},{"$f":"$F$457*$P$457","v":-96.291399999999996},{"$f":"$K$457*$P$457","v":0}]
[{"$f":"'Weight sheet'!$B$442","v":"ASSY, CABLE TEMPERATURE ELECTRONICS - A1W25"},{"$f":"'Weight sheet'!$C$442","v":4199372},{"$f":"'Weight sheet'!$D$442","v":52260},{"$f":"'Weight sheet'!$F$442","v":1},{"$f":"'Weight sheet'!$H$442","v":5.5},{"$f":"$E$458*$D$458","v":5.5},44.4,{"$f":"$G$458*2.54","v":112.776},{"$f":"$F$458*$H$458","v":620.26800000000003},0,{"$f":"$J$458*$D$458","v":0},{"$f":"$G$458","v":44.4},{"$f":"$L$458*2.54","v":112.776},{"$f":"$K$458*$M$458","v":0},0.5,{"$f":"$O$458*2.54","v":1.27},{"$f":"$F$458*$P$458","v":6.9850000000000003},{"$f":"$K$458*$P$458","v":0}]
[{"$f":"'Weight sheet'!$B$443","v":"COVER, PCBA TEMP. SENSOR / (4X) SCREW, BH #2-56 x .25 , 18-8 SS"},{"$f":"'Weight sheet'!$C$443","v":"4199409 / 4199124"},{"$f":"'Weight sheet'!$D$443","v":"52371 / 55221"},{"$f":"'Weight sheet'!$F$443","v":1},{"$f":"'Weight sheet'!$H$443","v":15.8},{"$f":"$E$459*$D$459","v":15.8},45.5,{"$f":"$G$459*2.54","v":115.57000000000001},{"$f":"$F$459*$H$459","v":1826.0060000000001},0,{"$f":"$J$459*$D$459","v":0},{"$f":"$G$459","v":45.5},{"$f":"$L$459*2.54","v":115.57000000000001},{"$f":"$K$459*$M$459","v":0},-1.9,{"$f":"$O$459*2.54","v":-4.8259999999999996},{"$f":"$F$459*$P$459","v":-76.250799999999998},{"$f":"$K$459*$P$459","v":0}]
[{"$f":"'Weight sheet'!$B$444","v":"PCBA, OXYGEN SENSOR + (4X) #4-40 x .250 SHCS"},{"$f":"'Weight sheet'!$C$444","v":"4199436 / 2549"},{"$f":"'Weight sheet'!$D$444","v":55524},{"$f":"'Weight sheet'!$F$444","v":1},{"$f":"'Weight sheet'!$H$444","v":23.4},{"$f":"$E$460*$D$460","v":23.4},45.5,{"$f":"$G$460*2.54","v":115.57000000000001},{"$f":"$F$460*$H$460","v":2704.3380000000002},0,{"$f":"$J$460*$D$460","v":0},{"$f":"$G$460","v":45.5},{"$f":"$L$460*2.54","v":115.57000000000001},{"$f":"$K$460*$M$460","v":0},-3.4,{"$f":"$O$460*2.54","v":-8.6359999999999992},{"$f":"$F$460*$P$460","v":-202.08239999999998},{"$f":"$K$460*$P$460","v":0}]
[{"$f":"'Weight sheet'!$B$446","v":"ASSY, CABLE - OXYGEN SENSOR PROCESSED SIGNAL - A1W33"},{"$f":"'Weight sheet'!$C$446","v":4199377},{"$f":"'Weight sheet'!$D$446","v":52265},{"$f":"'Weight sheet'!$F$446","v":1},{"$f":"'Weight sheet'!$H$446","v":5.9},{"$f":"$E$461*$D$461","v":5.9},44.4,{"$f":"$G$461*2.54","v":112.776},{"$f":"$F$461*$H$461","v":665.37840000000006},0,{"$f":"$J$461*$D$461","v":0},{"$f":"$G$461","v":44.4},{"$f":"$L$461*2.54","v":112.776},{"$f":"$K$461*$M$461","v":0},0,{"$f":"$O$461*2.54","v":0},{"$f":"$F$461*$P$461","v":0},{"$f":"$K$461*$P$461","v":0}]
[{"$f":"'Weight sheet'!$B$447","v":"ASSY, CABLE - TAIL PCBA SIGNAL INTERFACE - A1W13 (GREY)"},{"$f":"'Weight sheet'!$C$447","v":4199361},{"$f":"'Weight sheet'!$D$447","v":52248},{"$f":"'Weight sheet'!$F$447","v":1},{"$f":"'Weight sheet'!$H$447","v":29.6},{"$f":"$E$462*$D$462","v":29.6},38.625,{"$f":"$G$462*2.54","v":98.107500000000002},{"$f":"$F$462*$H$462","v":2903.982},0,{"$f":"$J$462*$D$462","v":0},{"$f":"$G$462","v":38.625},{"$f":"$L$462*2.54","v":98.107500000000002},{"$f":"$K$462*$M$462","v":0},3.5,{"$f":"$O$462*2.54","v":8.89},{"$f":"$F$462*$P$462","v":263.14400000000001},{"$f":"$K$462*$P$462","v":0}]
[{"$f":"'Weight sheet'!$B$448","v":"ASSY, CABLE - TAIL PCBA POWER INTERFACE - A1W14 (RAINBOW)"},{"$f":"'Weight sheet'!$C$448","v":4199362},{"$f":"'Weight sheet'!$D$448","v":52249},{"$f":"'Weight sheet'!$F$448","v":1},{"$f":"'Weight sheet'!$H$448","v":37.9},{"$f":"$E$463*$D$463","v":37.9},38.625,{"$f":"$G$463*2.54","v":98.107500000000002},{"$f":"$F$463*$H$463","v":3718.2742499999999},0,{"$f":"$J$463*$D$463","v":0},{"$f":"$G$463","v":38.625},{"$f":"$L$463*2.54","v":98.107500000000002},{"$f":"$K$463*$M$463","v":0},3.5,{"$f":"$O$463*2.54","v":8.89},{"$f":"$F$463*$P$463","v":336.93099999999998},{"$f":"$K$463*$P$463","v":0}]
[{"$f":"'Weight sheet'!$B$449","v":"Tape for Grey Ribbon Cable"},null,null,{"$f":"'Weight sheet'!$F$449","v":1},{"$f":"'Weight sheet'!$H$449","v":0.8},{"$f":"$E$464*$D$464","v":0.8},45.5,{"$f":"$G$464*2.54","v":115.57000000000001},{"$f":"$F$464*$H$464","v":92.456000000000017},0,{"$f":"$J$464*$D$464","v":0},{"$f":"$G$464","v":45.5},{"$f":"$L$464*2.54","v":115.57000000000001},{"$f":"$K$464*$M$464","v":0},3.5,{"$f":"$O$464*2.54","v":8.89},{"$f":"$F$464*$P$464","v":7.112000000000001},{"$f":"$K$464*$P$464","v":0}]
[{"$f":"'Weight sheet'!$B$450","v":"Tape for Rainbow Ribbon Cable"},null,null,{"$f":"'Weight sheet'!$F$450","v":1},{"$f":"'Weight sheet'!$H$450","v":0.9},{"$f":"$E$465*$D$465","v":0.9},45.5,{"$f":"$G$465*2.54","v":115.57000000000001},{"$f":"$F$465*$H$465","v":104.01300000000001},0,{"$f":"$J$465*$D$465","v":0},{"$f":"$G$465","v":45.5},{"$f":"$L$465*2.54","v":115.57000000000001},{"$f":"$K$465*$M$465","v":0},3.5,{"$f":"$O$465*2.54","v":8.89},{"$f":"$F$465*$P$465","v":8.0010000000000012},{"$f":"$K$465*$P$465","v":0}]
[{"$f":"'Weight sheet'!$B$451","v":"ASSY, SAIL, CONDUCTIVITY - TEMPERATURE (SEABIRD)"},{"$f":"'Weight sheet'!$C$451","v":4199407},{"$f":"'Weight sheet'!$D$451","v":52368},{"$f":"'Weight sheet'!$F$451","v":1},{"$f":"'Weight sheet'!$H$451","v":283},{"$f":"$E$466*$D$466","v":283},47.863999999999997,{"$f":"$G$466*2.54","v":121.57455999999999},{"$f":"$F$466*$H$466","v":34405.600480000001},184.02699999999999,{"$f":"$J$466*$D$466","v":184.02699999999999},{"$f":"$G$466","v":47.863999999999997},{"$f":"$L$466*2.54","v":121.57455999999999},{"$f":"$K$466*$M$466","v":22373.001553119997},7.0579999999999998,{"$f":"$O$466*2.54","v":17.927319999999998},{"$f":"$F$466*$P$466","v":5073.4315599999991},{"$f":"$K$466*$P$466","v":3299.1109176399996}]
[{"$f":"'Weight sheet'!$B$454","v":"PLUG, CT SAIL / RING, BACKUP , O-RING - TEFLON -016 / O-RING, EPDM -016 / O-RING EPDM -012"},{"$f":"'Weight sheet'!$C$454","v":"4286190 / 4199255 / 4199067 / 4199057"},{"$f":"'Weight sheet'!$D$454","v":"-"},{"$f":"'Weight sheet'!$F$454","v":0},{"$f":"'Weight sheet'!$H$454","v":0},{"$f":"$E$467*$D$467","v":0},49.3,{"$f":"$G$467*2.54","v":125.22199999999999},{"$f":"$F$467*$H$467","v":0},5,{"$f":"$J$467*$D$467","v":0},{"$f":"$G$467","v":49.3},{"$f":"$L$467*2.54","v":125.22199999999999},{"$f":"$K$467*$M$467","v":0},4.9000000000000004,{"$f":"$O$467*2.54","v":12.446000000000002},{"$f":"$F$467*$P$467","v":0},{"$f":"$K$467*$P$467","v":0}]
[{"$f":"'Weight sheet'!$B$455","v":"NUT, CT SAIL"},{"$f":"'Weight sheet'!$C$455","v":4199406},{"$f":"'Weight sheet'!$D$455","v":"-"},{"$f":"'Weight sheet'!$F$455","v":1},{"$f":"'Weight sheet'!$H$455","v":9},{"$f":"$E$468*$D$468","v":9},49.3,{"$f":"$G$468*2.54","v":125.22199999999999},{"$f":"$F$468*$H$468","v":1126.998},0,{"$f":"$J$468*$D$468","v":0},{"$f":"$G$468","v":49.3},{"$f":"$L$468*2.54","v":125.22199999999999},{"$f":"$K$468*$M$468","v":0},4.8,{"$f":"$O$468*2.54","v":12.192},{"$f":"$F$468*$P$468","v":109.72800000000001},{"$f":"$K$468*$P$468","v":0}]
[{"$f":"'Weight sheet'!$B$456","v":"PIN, GUIDE, BATTERY PACK - TTI (\"STINGER\") / HARDSTOP, PITCH - TTI / SCREW, SOCKET HEAD - ALLEN, #8-32 x .375, SS"},{"$f":"'Weight sheet'!$C$456","v":"4205807 / 4205810 / 2601"},{"$f":"'Weight sheet'!$D$456","v":"-"},{"$f":"'Weight sheet'!$F$456","v":1},{"$f":"'Weight sheet'!$H$456","v":84.7},{"$f":"$E$469*$D$469","v":84.7},43.9,{"$f":"$G$469*2.54","v":111.506},{"$f":"$F$469*$H$469","v":9444.5581999999995},0,{"$f":"$J$469*$D$469","v":0},{"$f":"$G$469","v":43.9},{"$f":"$L$469*2.54","v":111.506},{"$f":"$K$469*$M$469","v":0},0,{"$f":"$O$469*2.54","v":0},{"$f":"$F$469*$P$469","v":0},{"$f":"$K$469*$P$469","v":0}]
[]
[null,null,null,null,null,"Total",null,null,"Moment",null,null,null,null,"Moment",null,null,"Moment","Moment"]
[null,null,null,"Qty","Weight","Weight","LCG","LCG","LCG","Volume","Total Vol","LCB","LCB","LCB","VCG","VCB","VCG","VCB"]
[null,null,null,null,"grams","grams","inch","cm","gm-cm","cc","cc","inch","cm","cc-cm","cm","cm","gm-cm","cc-cm"]
["Assy., Mass shifter",{"$f":"'Weight sheet'!$C$458","v":4199448},{"$f":"'Weight sheet'!$D$458","v":56768}]
[null,"Scale Weight",{"$f":"'Weight sheet'!$H$460","v":14008},"gm",{"$f":"$C$475","v":14008},{"$f":"$E$475-($F$477+$F$478)","v":2558.7999999999993},{"$f":"$H$475/2.54","v":27.817322834645672},70.656000000000006,{"$f":"$F$475*$H$475","v":180794.57279999997},null,2669.8,null,70.2,{"$f":"$K$475*$M$475","v":187419.96000000002},-0.56999999999999995,0,{"$f":"$F$475*$O$475","v":-1458.5159999999994},{"$f":"$K$475*$P$475","v":0}]
["Moveable Weight"]
["Battery Enclosure (with Brass weight)",{"$f":"'Weight sheet'!$C$462","v":"too many to record"},{"$f":"'Weight sheet'!$D$462","v":56759},{"$f":"'Weight sheet'!$F$463","v":1},{"$f":"'Weight sheet'!$H$463","v":1826.2},{"$f":"$E$477","v":1826.2},{"$f":"$H$477/2.54","v":35.97767746335596},{"$f":"82.634+$C$27*Cal!$D$16","v":91.383300756924143},{"$f":"$F$477*$H$477","v":166884.18384229488},null,0,null,{"$f":"$H$477","v":91.383300756924143},{"$f":"$K$477*$M$477","v":0},-6.7510000000000003,0,{"$f":"$F$477*$O$477","v":-12328.676200000002},{"$f":"$K$477*$P$477","v":0}]
["HV Battery",{"$f":"'Weight sheet'!$C$464","v":4199485},{"$f":"'Weight sheet'!$D$464","v":56831},{"$f":"'Weight sheet'!$F$464","v":1},{"$f":"'Weight sheet'!$H$464","v":9623},{"$f":"$E$478","v":9623},{"$f":"$H$478/2.54","v":36.284370376741784},{"$f":"83.413+$C$27*Cal!$D$16","v":92.162300756924139},{"$f":"$F$478*$H$478","v":886877.82018388098},null,0,null,{"$f":"$H$478","v":92.162300756924139},{"$f":"$K$478*$M$478","v":0},-0.02,{"$f":"$O$478","v":-0.02},{"$f":"$F$478*$O$478","v":-192.46},{"$f":"$K$478*$P$478","v":0}]
[]
["Assy., Electronics",{"$f":"'Weight sheet'!$C$478","v":4199398},{"$f":"'Weight sheet'!$D$478","v":52347}]
[null,"Subtotal Weight",{"$f":"SUM($E$484:$E$495)","v":3962.7},"gm","diff"]
[null,"Scale Weight",{"$f":"'Weight sheet'!$H$480","v":3974.1},"gm",{"$f":"$C$482-$C$481","v":11.400000000000091}]
[]
[{"$f":"'Weight sheet'!$B$482","v":"Electronics rail, port"},{"$f":"'Weight sheet'!$C$482","v":4199465},{"$f":"'Weight sheet'!$D$482","v":56785},{"$f":"'Weight sheet'!$F$482","v":1},{"$f":"'Weight sheet'!$H$482","v":62},{"$f":"$E$484*$D$484","v":62},23.507000000000001,{"$f":"$G$484*2.54","v":59.707780000000007},{"$f":"$F$484*$H$484","v":3701.8823600000005},0,{"$f":"$J$484*$D$484","v":0},{"$f":"$G$484","v":23.507000000000001},{"$f":"$L$484*2.54","v":59.707780000000007},{"$f":"$K$484*$M$484","v":0},0,{"$f":"$O$484*2.54","v":0},{"$f":"$F$484*$P$484","v":0},{"$f":"$K$484*$P$484","v":0}]
[{"$f":"'Weight sheet'!$B$483","v":"Electronics rail, starboard"},{"$f":"'Weight sheet'!$C$483","v":4199499},{"$f":"'Weight sheet'!$D$483","v":57672},{"$f":"'Weight sheet'!$F$483","v":1},{"$f":"'Weight sheet'!$H$483","v":61.4},{"$f":"$E$485*$D$485","v":61.4},23.507000000000001,{"$f":"$G$485*2.54","v":59.707780000000007},{"$f":"$F$485*$H$485","v":3666.0576920000003},0,{"$f":"$J$485*$D$485","v":0},{"$f":"$G$485","v":23.507000000000001},{"$f":"$L$485*2.54","v":59.707780000000007},{"$f":"$K$485*$M$485","v":0},0,{"$f":"$O$485*2.54","v":0},{"$f":"$F$485*$P$485","v":0},{"$f":"$K$485*$P$485","v":0}]
[{"$f":"'Weight sheet'!$B$484","v":"Seaglider Main board (Mother board, TT8, CF8, flash card)"},{"$f":"'Weight sheet'!$C$484","v":4199386},{"$f":"'Weight sheet'!$D$484","v":52290},{"$f":"'Weight sheet'!$F$484","v":1},{"$f":"'Weight sheet'!$H$484","v":262.8},{"$f":"$E$486*$D$486","v":262.8},21.5,{"$f":"$G$486*2.54","v":54.61},{"$f":"$F$486*$H$486","v":14351.508},0,{"$f":"$J$486*$D$486","v":0},{"$f":"$G$486","v":21.5},{"$f":"$L$486*2.54","v":54.61},{"$f":"$K$486*$M$486","v":0},0.7,{"$f":"$O$486*2.54","v":1.7779999999999998},{"$f":"$F$486*$P$486","v":467.25839999999999},{"$f":"$K$486*$P$486","v":0}]
[{"$f":"'Weight sheet'!$B$489","v":" Insulation Sheet-OEM/Main"},{"$f":"'Weight sheet'!$C$489","v":4199408},{"$f":"'Weight sheet'!$D$489","v":52370},{"$f":"'Weight sheet'!$F$489","v":1},{"$f":"'Weight sheet'!$H$489","v":4.8},{"$f":"$E$487*$D$487","v":4.8},21.73,{"$f":"$G$487*2.54","v":55.194200000000002},{"$f":"$F$487*$H$487","v":264.93216000000001},0,{"$f":"$J$487*$D$487","v":0},{"$f":"$G$487","v":21.73},{"$f":"$L$487*2.54","v":55.194200000000002},{"$f":"$K$487*$M$487","v":0},0.44,{"$f":"$O$487*2.54","v":1.1175999999999999},{"$f":"$F$487*$P$487","v":5.3644799999999995},{"$f":"$K$487*$P$487","v":0}]
[{"$f":"'Weight sheet'!$B$490","v":"(6x) 6-32 x 1/4 PHMS, main board to rails"},{"$f":"'Weight sheet'!$C$490","v":4146090},{"$f":"'Weight sheet'!$D$490","v":55209},{"$f":"'Weight sheet'!$F$490","v":1},{"$f":"'Weight sheet'!$H$490","v":4.5},{"$f":"$E$488*$D$488","v":4.5},21.5,{"$f":"$G$488*2.54","v":54.61},{"$f":"$F$488*$H$488","v":245.745},0,{"$f":"$J$488*$D$488","v":0},{"$f":"$G$488","v":21.5},{"$f":"$L$488*2.54","v":54.61},{"$f":"$K$488*$M$488","v":0},0.5,{"$f":"$O$488*2.54","v":1.27},{"$f":"$F$488*$P$488","v":5.7149999999999999},{"$f":"$K$488*$P$488","v":0}]
[{"$f":"'Weight sheet'!$B$491","v":"Assy., OEM Navigation Board (transponder PCB, transformer/inductor, capacitors, GPS receiver, W6 GPS serial interface, GPS antenna cable,DC-DC converter, Cable Assembly W7, all soldered on wiring )"},{"$f":"'Weight sheet'!$C$491","v":4199370},{"$f":"'Weight sheet'!$D$491","v":52257},{"$f":"'Weight sheet'!$F$491","v":1},{"$f":"'Weight sheet'!$H$491","v":591.4},{"$f":"$E$489*$D$489","v":591.4},21.5,{"$f":"$G$489*2.54","v":54.61},{"$f":"$F$489*$H$489","v":32296.353999999999},0,{"$f":"$J$489*$D$489","v":0},{"$f":"$G$489","v":21.5},{"$f":"$L$489*2.54","v":54.61},{"$f":"$K$489*$M$489","v":0},-0.43,{"$f":"$O$489*2.54","v":-1.0922000000000001},{"$f":"$F$489*$P$489","v":-645.92708000000005},{"$f":"$K$489*$P$489","v":0}]
[{"$f":"'Weight sheet'!$B$499","v":"(6x) 6-32 x 1/4 PHMS, OEM board to rails"},{"$f":"'Weight sheet'!$C$499","v":4146090},{"$f":"'Weight sheet'!$D$499","v":55209},{"$f":"'Weight sheet'!$F$499","v":1},{"$f":"'Weight sheet'!$H$499","v":4.5},{"$f":"$E$490*$D$490","v":4.5},21.48,{"$f":"$G$490*2.54","v":54.559200000000004},{"$f":"$F$490*$H$490","v":245.51640000000003},0,{"$f":"$J$490*$D$490","v":0},{"$f":"$G$490","v":21.48},{"$f":"$L$490*2.54","v":54.559200000000004},{"$f":"$K$490*$M$490","v":0},-0.43,{"$f":"$O$490*2.54","v":-1.0922000000000001},{"$f":"$F$490*$P$490","v":-4.9149000000000003},{"$f":"$K$490*$P$490","v":0}]
[{"$f":"'Weight sheet'!$B$500","v":"Assy.,  Iridium Modem and bracket (includes satellite receiver - iridium LBT, cable assy W3, all clamps for wires, RF switch, DC block, and mounting hardware)"},{"$f":"'Weight sheet'!$C$500","v":4199389},52324,{"$f":"'Weight sheet'!$F$500","v":1},{"$f":"'Weight sheet'!$H$500","v":278.2},{"$f":"$E$491*$D$491","v":278.2},21.6,{"$f":"$G$491*2.54","v":54.864000000000004},{"$f":"$F$491*$H$491","v":15263.1648},0,{"$f":"$J$491*$D$491","v":0},{"$f":"$G$491","v":21.6},{"$f":"$L$491*2.54","v":54.864000000000004},{"$f":"$K$491*$M$491","v":0},1.9,{"$f":"$O$491*2.54","v":4.8259999999999996},{"$f":"$F$491*$P$491","v":1342.5931999999998},{"$f":"$K$491*$P$491","v":0}]
[{"$f":"'Weight sheet'!$B$506","v":"(4x) 6-32 x 1/4 PHMS + #6 LW, modem cage to rails"},{"$f":"'Weight sheet'!$C$506","v":"4146090 / 4199122"},{"$f":"'Weight sheet'!$D$506","v":"55209 / 55217"},{"$f":"'Weight sheet'!$F$506","v":1},{"$f":"'Weight sheet'!$H$506","v":3.5},{"$f":"$E$492*$D$492","v":3.5},20.77,{"$f":"$G$492*2.54","v":52.755800000000001},{"$f":"$F$492*$H$492","v":184.64529999999999},0,{"$f":"$J$492*$D$492","v":0},{"$f":"$G$492","v":20.77},{"$f":"$L$492*2.54","v":52.755800000000001},{"$f":"$K$492*$M$492","v":0},0.28999999999999998,{"$f":"$O$492*2.54","v":0.73659999999999992},{"$f":"$F$492*$P$492","v":2.5780999999999996},{"$f":"$K$492*$P$492","v":0}]
[{"$f":"'Weight sheet'!$B$507","v":"Battery Pack, LV w/ CA W1"},{"$f":"'Weight sheet'!$C$507","v":4199484},{"$f":"'Weight sheet'!$D$507","v":56830},{"$f":"'Weight sheet'!$F$507","v":1},{"$f":"'Weight sheet'!$H$507","v":2612.1},{"$f":"$E$493*$D$493","v":2612.1},21.6,{"$f":"$G$493*2.54","v":54.864000000000004},{"$f":"$F$493*$H$493","v":143310.25440000001},0,{"$f":"$J$493*$D$493","v":0},{"$f":"$G$493","v":21.6},{"$f":"$L$493*2.54","v":54.864000000000004},{"$f":"$K$493*$M$493","v":0},-1.81,{"$f":"$O$493*2.54","v":-4.5974000000000004},{"$f":"$F$493*$P$493","v":-12008.868540000001},{"$f":"$K$493*$P$493","v":0}]
[{"$f":"'Weight sheet'!$B$509","v":"Battery Pack Cage, LV + Two strips of tape "},{"$f":"'Weight sheet'!$C$509","v":4199335},{"$f":"'Weight sheet'!$D$509","v":49847},{"$f":"'Weight sheet'!$F$509","v":1},{"$f":"'Weight sheet'!$H$509","v":72.3},{"$f":"$E$494*$D$494","v":72.3},21.6,{"$f":"$G$494*2.54","v":54.864000000000004},{"$f":"$F$494*$H$494","v":3966.6672000000003},0,{"$f":"$J$494*$D$494","v":0},{"$f":"$G$494","v":21.6},{"$f":"$L$494*2.54","v":54.864000000000004},{"$f":"$K$494*$M$494","v":0},-1.64,{"$f":"$O$494*2.54","v":-4.1655999999999995},{"$f":"$F$494*$P$494","v":-301.17287999999996},{"$f":"$K$494*$P$494","v":0}]
[{"$f":"'Weight sheet'!$B$510","v":"(6x) 6-32 x 1/4 PHMS + #6 LW, batt. cage to rails"},{"$f":"'Weight sheet'!$C$510","v":"4146090 / 4199122"},{"$f":"'Weight sheet'!$D$510","v":"55209 / 55217"},{"$f":"'Weight sheet'!$F$510","v":1},{"$f":"'Weight sheet'!$H$510","v":5.2},{"$f":"$E$495*$D$495","v":5.2},21.78,{"$f":"$G$495*2.54","v":55.321200000000005},{"$f":"$F$495*$H$495","v":287.67024000000004},0,{"$f":"$J$495*$D$495","v":0},{"$f":"$G$495","v":21.78},{"$f":"$L$495*2.54","v":55.321200000000005},{"$f":"$K$495*$M$495","v":0},-0.25,{"$f":"$O$495*2.54","v":-0.63500000000000001},{"$f":"$F$495*$P$495","v":-3.302},{"$f":"$K$495*$P$495","v":0}]
[]
["Assy., Battery Hull Sections",{"$f":"'Weight sheet'!$C$512","v":4199340},{"$f":"'Weight sheet'!$D$512","v":49878}]
[null,"Subtotal Weight",{"$f":"SUM($F$500:$F$508)","v":7978.8},"gm","diff"]
[null,"Scale Weight",{"$f":"'Weight sheet'!$H$514","v":7977},"gm",{"$f":"$C$499-$C$498","v":-1.8000000000001819}]
[{"$f":"'Weight sheet'!$B$515","v":"Hull, Fwd Battery"},{"$f":"'Weight sheet'!$C$515","v":4199326},{"$f":"'Weight sheet'!$D$515","v":49817},{"$f":"'Weight sheet'!$F$515","v":1},{"$f":"'Weight sheet'!$H$515","v":3612},{"$f":"$E$500*$D$500","v":3612},43.539000000000001,{"$f":"$G$500*2.54","v":110.58906},{"$f":"$F$500*$H$500","v":399447.68472000002},12257.8,{"$f":"$J$500*$D$500","v":12257.8},43.539000000000001,{"$f":"$L$500*2.54","v":110.58906},{"$f":"$K$500*$M$500","v":1355578.5796679999},0,{"$f":"$O$500*2.54","v":0},{"$f":"$F$500*$P$500","v":0},{"$f":"$K$500*$P$500","v":0}]
[{"$f":"'Weight sheet'!$B$516","v":"Hull, Aft Battery"},{"$f":"'Weight sheet'!$C$516","v":4199326},{"$f":"'Weight sheet'!$D$516","v":49817},{"$f":"'Weight sheet'!$F$516","v":1},{"$f":"'Weight sheet'!$H$516","v":3608},{"$f":"$E$501*$D$501","v":3608},33.670999999999999,{"$f":"$G$501*2.54","v":85.524339999999995},{"$f":"$F$501*$H$501","v":308571.81871999998},12257.8,{"$f":"$J$501*$D$501","v":12257.8},33.670999999999999,{"$f":"$L$501*2.54","v":85.524339999999995},{"$f":"$K$501*$M$501","v":1048340.2548519999},0,{"$f":"$O$501*2.54","v":0},{"$f":"$F$501*$P$501","v":0},{"$f":"$K$501*$P$501","v":0}]
[{"$f":"'Weight sheet'!$B$517","v":"Joint Ring , battery hulls"},{"$f":"'Weight sheet'!$C$517","v":4199327},{"$f":"'Weight sheet'!$D$517","v":49818},{"$f":"'Weight sheet'!$F$517","v":1},{"$f":"'Weight sheet'!$H$517","v":681},{"$f":"$E$502*$D$502","v":681},38.935000000000002,{"$f":"$G$502*2.54","v":98.894900000000007},{"$f":"$F$502*$H$502","v":67347.426900000006},436.8,{"$f":"$J$502*$D$502","v":436.8},{"$f":"$G$502","v":38.935000000000002},{"$f":"$L$502*2.54","v":98.894900000000007},{"$f":"$K$502*$M$502","v":43197.292320000008},0,{"$f":"$O$502*2.54","v":0},{"$f":"$F$502*$P$502","v":0},{"$f":"$K$502*$P$502","v":0}]
[{"$f":"'Weight sheet'!$B$518","v":"(8x) 6-32 x 3/4 SHCS + #6 LW, joint ring to fwd/aft batt. Hull"},{"$f":"'Weight sheet'!$C$518","v":"4199121 / 4199122"},{"$f":"'Weight sheet'!$D$518","v":"55215 / 55217"},{"$f":"'Weight sheet'!$F$518","v":1},{"$f":"'Weight sheet'!$H$518","v":13.2},{"$f":"$E$503*$D$503","v":13.2},38.625,{"$f":"$G$503*2.54","v":98.107500000000002},{"$f":"$F$503*$H$503","v":1295.019},0,{"$f":"$J$503*$D$503","v":0},{"$f":"$G$503","v":38.625},{"$f":"$L$503*2.54","v":98.107500000000002},{"$f":"$K$503*$M$503","v":0},0,{"$f":"$O$503*2.54","v":0},{"$f":"$F$503*$P$503","v":0},{"$f":"$K$503*$P$503","v":0}]
[{"$f":"'Weight sheet'!$B$519","v":"Grounding Strap 17.5\""},null,null,{"$f":"'Weight sheet'!$F$519","v":0},{"$f":"'Weight sheet'!$H$519","v":0},{"$f":"$E$504*$D$504","v":0},38.6,{"$f":"$G$504*2.54","v":98.044000000000011},{"$f":"$F$504*$H$504","v":0},0,{"$f":"$J$504*$D$504","v":0},{"$f":"$G$504","v":38.6},{"$f":"$L$504*2.54","v":98.044000000000011},{"$f":"$K$504*$M$504","v":0},3.95,{"$f":"$O$504*2.54","v":10.033000000000001},{"$f":"$F$504*$P$504","v":0},{"$f":"$K$504*$P$504","v":0}]
[{"$f":"'Weight sheet'!$B$520","v":"(2x) O-Ring, E70-271"},{"$f":"'Weight sheet'!$C$520","v":4199060},{"$f":"'Weight sheet'!$D$520","v":52412},{"$f":"'Weight sheet'!$F$520","v":1},{"$f":"'Weight sheet'!$H$520","v":16.5},{"$f":"$E$505*$D$505","v":16.5},38.625,{"$f":"$G$505*2.54","v":98.107500000000002},{"$f":"$F$505*$H$505","v":1618.7737500000001},7.32,{"$f":"$J$505*$D$505","v":7.32},{"$f":"$G$505","v":38.625},{"$f":"$L$505*2.54","v":98.107500000000002},{"$f":"$K$505*$M$505","v":718.14690000000007},0,{"$f":"$O$505*2.54","v":0},{"$f":"$F$505*$P$505","v":0},{"$f":"$K$505*$P$505","v":0}]
[{"$f":"'Weight sheet'!$B$521","v":"(12x) Clips, Rib"},{"$f":"'Weight sheet'!$C$521","v":4199341},{"$f":"'Weight sheet'!$D$521","v":49883},{"$f":"'Weight sheet'!$F$521","v":1},{"$f":"'Weight sheet'!$H$521","v":25.8},{"$f":"$E$506*$D$506","v":25.8},38.625,{"$f":"$G$506*2.54","v":98.107500000000002},{"$f":"$F$506*$H$506","v":2531.1735000000003},0,{"$f":"$J$506*$D$506","v":0},{"$f":"$G$506","v":38.625},{"$f":"$L$506*2.54","v":98.107500000000002},{"$f":"$K$506*$M$506","v":0},3.95,{"$f":"$O$506*2.54","v":10.033000000000001},{"$f":"$F$506*$P$506","v":258.85140000000001},{"$f":"$K$506*$P$506","v":0}]
[{"$f":"'Weight sheet'!$B$522","v":"(12x) Clips, Wiring"},{"$f":"'Weight sheet'!$C$522","v":4199412},{"$f":"'Weight sheet'!$D$522","v":52405},{"$f":"'Weight sheet'!$F$522","v":1},{"$f":"'Weight sheet'!$H$522","v":18.5},{"$f":"$E$507*$D$507","v":18.5},38.625,{"$f":"$G$507*2.54","v":98.107500000000002},{"$f":"$F$507*$H$507","v":1814.98875},0,{"$f":"$J$507*$D$507","v":0},{"$f":"$G$507","v":38.625},{"$f":"$L$507*2.54","v":98.107500000000002},{"$f":"$K$507*$M$507","v":0},3.95,{"$f":"$O$507*2.54","v":10.033000000000001},{"$f":"$F$507*$P$507","v":185.61050000000003},{"$f":"$K$507*$P$507","v":0}]
[{"$f":"'Weight sheet'!$B$523","v":"Oil Absorption pad, 1.9\" x 10.125\" + (2x) rib clips"},{"$f":"'Weight sheet'!$C$523","v":"4134111 / 4199341"},{"$f":"'Weight sheet'!$D$523","v":"55527 / 49883"},{"$f":"'Weight sheet'!$F$523","v":1},{"$f":"'Weight sheet'!$H$523","v":3.8},{"$f":"$E$508*$D$508","v":3.8},38.625,{"$f":"$G$508*2.54","v":98.107500000000002},{"$f":"$F$508*$H$508","v":372.80849999999998},0,{"$f":"$J$508*$D$508","v":0},{"$f":"$G$508","v":38.625},{"$f":"$L$508*2.54","v":98.107500000000002},{"$f":"$K$508*$M$508","v":0},3.95,{"$f":"$O$508*2.54","v":10.033000000000001},{"$f":"$F$508*$P$508","v":38.125400000000006},{"$f":"$K$508*$P$508","v":0}]
[]
["Assy., Forward Hull Sections",{"$f":"'Weight sheet'!$C$525","v":4199339},{"$f":"'Weight sheet'!$D$525","v":49877}]
[null,"Subtotal Weight",{"$f":"SUM($F$513:$F$523)","v":5145.2999999999993},"gm","diff"]
[null,"Scale Weight",{"$f":"'Weight sheet'!$H$527","v":5146},"gm",{"$f":"$C$512-$C$511","v":0.7000000000007276}]
[{"$f":"'Weight sheet'!$B$528","v":"Endcap, Forward"},{"$f":"'Weight sheet'!$C$528","v":4199329},{"$f":"'Weight sheet'!$D$528","v":49830},{"$f":"'Weight sheet'!$F$528","v":1},{"$f":"'Weight sheet'!$H$528","v":1887},{"$f":"$E$513*$D$513","v":1887},15.566000000000001,{"$f":"$G$513*2.54","v":39.537640000000003},{"$f":"$F$513*$H$513","v":74607.52668000001},5178.3,{"$f":"$J$513*$D$513","v":5178.3},15.781000000000001,{"$f":"$L$513*2.54","v":40.083739999999999},{"$f":"$K$513*$M$513","v":207565.63084200001},0,{"$f":"$O$513*2.54","v":0},{"$f":"$F$513*$P$513","v":0},{"$f":"$K$513*$P$513","v":0}]
[{"$f":"'Weight sheet'!$B$529","v":"Acoustic transducer (ITC-3013), w/ cable W36"},{"$f":"'Weight sheet'!$C$529","v":"4199379 / 4199036"},{"$f":"'Weight sheet'!$D$529","v":"52267 / 52223"},{"$f":"'Weight sheet'!$F$529","v":1},{"$f":"'Weight sheet'!$H$529","v":1436},{"$f":"$E$514*$D$514","v":1436},9.0150000000000006,{"$f":"$G$514*2.54","v":22.898100000000003},{"$f":"$F$514*$H$514","v":32881.671600000001},656.2,{"$f":"$J$514*$D$514","v":656.2},9.0150000000000006,{"$f":"$L$514*2.54","v":22.898100000000003},{"$f":"$K$514*$M$514","v":15025.733220000004},0,{"$f":"$O$514*2.54","v":0},{"$f":"$F$514*$P$514","v":0},{"$f":"$K$514*$P$514","v":0}]
[{"$f":"'Weight sheet'!$B$531","v":"O-Ring, E70-238, transducer to Endcap"},{"$f":"'Weight sheet'!$C$531","v":4199062},{"$f":"'Weight sheet'!$D$531","v":52413},{"$f":"'Weight sheet'!$F$531","v":1},{"$f":"'Weight sheet'!$H$531","v":3.2},{"$f":"$E$515*$D$515","v":3.2},10.5,{"$f":"$G$515*2.54","v":26.67},{"$f":"$F$515*$H$515","v":85.344000000000008},0,{"$f":"$J$515*$D$515","v":0},{"$f":"$G$515","v":10.5},{"$f":"$L$515*2.54","v":26.67},{"$f":"$K$515*$M$515","v":0},0,{"$f":"$O$515*2.54","v":0},{"$f":"$F$515*$P$515","v":0},{"$f":"$K$515*$P$515","v":0}]
[{"$f":"'Weight sheet'!$B$532","v":"(6x) Alum 1/4-20 x 3/4 SHCS + 1/4 LW, xducer to end cap"},{"$f":"'Weight sheet'!$C$532","v":"4199127 / 4199134"},{"$f":"'Weight sheet'!$D$532","v":"55236 / 55252"},{"$f":"'Weight sheet'!$F$532","v":1},{"$f":"'Weight sheet'!$H$532","v":15.1},{"$f":"$E$516*$D$516","v":15.1},10.7,{"$f":"$G$516*2.54","v":27.177999999999997},{"$f":"$F$516*$H$516","v":410.38779999999997},0,{"$f":"$J$516*$D$516","v":0},{"$f":"$G$516","v":10.7},{"$f":"$L$516*2.54","v":27.177999999999997},{"$f":"$K$516*$M$516","v":0},0,{"$f":"$O$516*2.54","v":0},{"$f":"$F$516*$P$516","v":0},{"$f":"$K$516*$P$516","v":0}]
[{"$f":"'Weight sheet'!$B$533","v":"Hull, Electronics"},{"$f":"'Weight sheet'!$C$533","v":4199328},{"$f":"'Weight sheet'!$D$533","v":49829},{"$f":"'Weight sheet'!$F$533","v":1},{"$f":"'Weight sheet'!$H$533","v":1690},{"$f":"$E$517*$D$517","v":1690},22.843,{"$f":"$G$517*2.54","v":58.02122},{"$f":"$F$517*$H$517","v":98055.861799999999},5240.8999999999996,{"$f":"$J$517*$D$517","v":5240.8999999999996},22.919,{"$f":"$L$517*2.54","v":58.214260000000003},{"$f":"$K$517*$M$517","v":305095.11523399997},0,{"$f":"$O$517*2.54","v":0},{"$f":"$F$517*$P$517","v":0},{"$f":"$K$517*$P$517","v":0}]
[{"$f":"'Weight sheet'!$B$534","v":"O-Ring, E70-263, elec hull to fwd endcap"},{"$f":"'Weight sheet'!$C$534","v":4199058},{"$f":"'Weight sheet'!$D$534","v":52410},{"$f":"'Weight sheet'!$F$534","v":1},{"$f":"'Weight sheet'!$H$534","v":6.6},{"$f":"$E$518*$D$518","v":6.6},19.77,{"$f":"$G$518*2.54","v":50.215800000000002},{"$f":"$F$518*$H$518","v":331.42428000000001},5.76,{"$f":"$J$518*$D$518","v":5.76},{"$f":"$G$518","v":19.77},{"$f":"$L$518*2.54","v":50.215800000000002},{"$f":"$K$518*$M$518","v":289.24300799999997},0,{"$f":"$O$518*2.54","v":0},{"$f":"$F$518*$P$518","v":0},{"$f":"$K$518*$P$518","v":0}]
[{"$f":"'Weight sheet'!$B$535","v":"(8x) 6-32 x 1/2 SHCS + #6 LW, elec hull to fwd endcap"},{"$f":"'Weight sheet'!$C$535","v":"4199111 / 4199122"},{"$f":"'Weight sheet'!$D$535","v":"55183 / 55217"},{"$f":"'Weight sheet'!$F$535","v":1},{"$f":"'Weight sheet'!$H$535","v":10.4},{"$f":"$E$519*$D$519","v":10.4},19.87,{"$f":"$G$519*2.54","v":50.469800000000006},{"$f":"$F$519*$H$519","v":524.88592000000006},0,{"$f":"$J$519*$D$519","v":0},{"$f":"$G$519","v":19.87},{"$f":"$L$519*2.54","v":50.469800000000006},{"$f":"$K$519*$M$519","v":0},0,{"$f":"$O$519*2.54","v":0},{"$f":"$F$519*$P$519","v":0},{"$f":"$K$519*$P$519","v":0}]
[{"$f":"'Weight sheet'!$B$536","v":"Grounding Strap 24\""},null,null,{"$f":"'Weight sheet'!$F$536","v":1},{"$f":"'Weight sheet'!$H$536","v":24.7},{"$f":"$E$520*$D$520","v":24.7},15.33,{"$f":"$G$520*2.54","v":38.938200000000002},{"$f":"$F$520*$H$520","v":961.77354000000003},0,{"$f":"$J$520*$D$520","v":0},{"$f":"$G$520","v":15.33},{"$f":"$L$520*2.54","v":38.938200000000002},{"$f":"$K$520*$M$520","v":0},0.38,{"$f":"$O$520*2.54","v":0.96520000000000006},{"$f":"$F$520*$P$520","v":23.840440000000001},{"$f":"$K$520*$P$520","v":0}]
[{"$f":"'Weight sheet'!$B$537","v":"Compass bracket,Compass w/compass carrier PCB (w/ tywrap),(4x) 4-40 x 3/8 SHCS + #4 x 1/8L stand off + #4LW"},{"$f":"'Weight sheet'!$C$537","v":"4199336,4199420 / 4205793,4199126 / 4199146 /19928"},{"$f":"'Weight sheet'!$D$537","v":"49848, 55305 / 57690,55228 / 55282"},{"$f":"'Weight sheet'!$F$537","v":1},{"$f":"'Weight sheet'!$H$537","v":48.9},{"$f":"$E$521*$D$521","v":48.9},12.01,{"$f":"$G$521*2.54","v":30.505400000000002},{"$f":"$F$521*$H$521","v":1491.71406},0,{"$f":"$J$521*$D$521","v":0},{"$f":"$G$521","v":12.01},{"$f":"$L$521*2.54","v":30.505400000000002},{"$f":"$K$521*$M$521","v":0},-0.35,{"$f":"$O$521*2.54","v":-0.8889999999999999},{"$f":"$F$521*$P$521","v":-43.47209999999999},{"$f":"$K$521*$P$521","v":0}]
[{"$f":"'Weight sheet'!$B$540","v":"(2x) 4-40 X 3/8 SHCS + #4 LW, comp mt to fwd endcap"},{"$f":"'Weight sheet'!$C$540","v":"4199126 / 19928"},{"$f":"'Weight sheet'!$D$540","v":"55228 / 55233"},{"$f":"'Weight sheet'!$F$540","v":1},{"$f":"'Weight sheet'!$H$540","v":1.3},{"$f":"$E$522*$D$522","v":1.3},10.8,{"$f":"$G$522*2.54","v":27.432000000000002},{"$f":"$F$522*$H$522","v":35.661600000000007},0,{"$f":"$J$522*$D$522","v":0},{"$f":"$G$522","v":10.8},{"$f":"$L$522*2.54","v":27.432000000000002},{"$f":"$K$522*$M$522","v":0},-0.81,{"$f":"$O$522*2.54","v":-2.0574000000000003},{"$f":"$F$522*$P$522","v":-2.6746200000000004},{"$f":"$K$522*$P$522","v":0}]
[{"$f":"'Weight sheet'!$B$541","v":"Cable Assembly W9  (compass cable)"},{"$f":"'Weight sheet'!$C$541","v":4199357},{"$f":"'Weight sheet'!$D$541","v":52244},{"$f":"'Weight sheet'!$F$541","v":1},{"$f":"'Weight sheet'!$H$541","v":22.1},{"$f":"$E$523*$D$523","v":22.1},15.33,{"$f":"$G$523*2.54","v":38.938200000000002},{"$f":"$F$523*$H$523","v":860.53422000000012},0,{"$f":"$J$523*$D$523","v":0},{"$f":"$G$523","v":15.33},{"$f":"$L$523*2.54","v":38.938200000000002},{"$f":"$K$523*$M$523","v":0},0.38,{"$f":"$O$523*2.54","v":0.96520000000000006},{"$f":"$F$523*$P$523","v":21.330920000000003},{"$f":"$K$523*$P$523","v":0}]

{"sheet":"Lead Worksheet","index":3,"n_rows":44,"n_cols":18,"rows_kept":44,"cut":false,"hidden":false,"merged":[]}
["SG lead worksheet","SG",{"$f":"Cal!$D$1","v":512}]
[null,"date","2015-05-04",null,"Ballast for:","OCEAN"]
[null,"time",null,null,"Density:",{"$f":"rho_2","v":1.0275000000000001}]
[null,"who","RH",null,"Thrust:","~250","cc"]
[]
[null,"Wt. goal","Actual",null,null,null,null,null,null,null,null,null,"Actual"]
["Forward Fairing","grams","grams/pcs",null,null,null,null,null,null,null,null,null,"sum grams"]
["Nose plates  (qty)",{"$f":"Trim!$D$68","v":1},"pc-1","pc-2","pc-3","pc-4","pc-5","pc-6","pc-7","pc-8","pc-9"]
["weights",{"$f":"IF(Trim!$D$62=1,Trim!$F$68,Trim!$F$118)","v":479.7},246.5,null,233.2,null,null,null,null,null,null,null,{"$f":"SUM($C$9:$I$9)","v":479.7},null,null,{"$f":"$B$9-$M$9","v":0}]
["screws",{"$f":"IF(Trim!$D$62=1,SUM(Trim!$F$69:$F$71),SUM(Trim!$F$119:$F$121))","v":20.6},20.6,null,null,null,null,null,null,null,null,null,{"$f":"SUM($C$10:$I$10)","v":20.6},null,null,{"$f":"$B$10-$M$10","v":0}]
[null,null,null,null,null,null,null,null,null,"sum lead",null,null,{"$f":"SUM($M$9:$M$10)","v":500.3}]
[null,null,null,null,null,null,null,"Scale weight of fwd fairing with nose plates added",{"$f":"'Weight sheet'!$H$10","v":7744.3},"gm"]
[]
["Lead On Pupa At Fairing Joint Ring",null,"port/top",null,null,null,"middle",null,null,null,"stbrd/bottom"]
[]
["Bottom side Weight"]
["weight tape",{"$f":"Trim!$F$76","v":173.3},null,null,null,null,173.3,null,null,null,null,null,{"$f":"SUM($C$17:$K$17)","v":173.3},null,null,{"$f":"$B$17-$M$17","v":0}]
["rubber & tape",{"$f":"Trim!$F$77","v":0},null,null,null,null,null,null,null,null,null,null,{"$f":"SUM($C$18:$K$18)","v":0},null,null,{"$f":"$B$18-$M$18","v":0}]
["Port side Weight"]
["weight tape",{"$f":"Trim!$F$78","v":0},null,null,null,null,null,null,null,null,null,null,{"$f":"SUM($C$20:$K$20)","v":0},null,null,{"$f":"$B$20-$M$20","v":0}]
["rubber & tape",{"$f":"Trim!$F$79","v":20.8},null,null,null,null,20.8,null,null,null,null,null,{"$f":"SUM($C$21:$K$21)","v":20.8},null,null,{"$f":"$B$21-$M$21","v":0}]
["Starboard side Weight"]
["weight tape",{"$f":"Trim!$F$80","v":172.9},null,null,null,null,172.9,null,null,null,null,null,{"$f":"SUM($C$23:$K$23)","v":172.9},null,null,{"$f":"$B$23-$M$23","v":0}]
["rubber & tape",{"$f":"Trim!$F$81","v":19.8},null,null,null,null,19.8,null,null,null,null,null,{"$f":"SUM($C$24:$K$24)","v":19.8},null,null,{"$f":"$B$24-$M$24","v":0}]
["Top side Weight"]
["weight tape",{"$f":"Trim!$F$82","v":184.1},null,null,null,null,184.1,null,null,null,null,null,{"$f":"SUM($C$26:$K$26)","v":184.1},null,null,{"$f":"$B$26-$M$26","v":0},null,"*FOAM"]
["rubber & tape",{"$f":"Trim!$F$83","v":0},null,null,null,null,null,null,null,null,null,null,{"$f":"SUM($C$27:$K$27)","v":0},null,null,{"$f":"$B$27-$M$27","v":0}]
["Trim Lead tape",{"$f":"Trim!$F$84","v":10.1},null,null,null,null,10.1,null,null,null,null,null,{"$f":"SUM($C$28:$K$28)","v":10.1},null,null,{"$f":"$B$28-$M$28","v":0}]
["All around strap",{"$f":"Trim!$F$85","v":0},null,null,null,null,null,null,null,null,null,null,{"$f":"SUM($C$29:$K$29)","v":0},null,null,{"$f":"$B$29-$M$29","v":0}]
["Total  tape at aft",{"$f":"Trim!$F$86","v":14.6},null,null,null,null,14.6,null,null,null,null,null,{"$f":"SUM($C$30:$K$30)","v":14.6},null,null,{"$f":"$B$30-$M$30","v":0}]
[null,null,null,null,null,null,null,null,null,null,"sum lead",null,{"$f":"SUM($M$16:$M$30)","v":595.6}]
[null,null,null,null,null,null,null,"Scale weight of pupa with lead added:",{"$f":"Trim!$M$9","v":39551.9},"gm"]
[]
[null,null,"port/top",null,null,null,"middle",null,null,null,"stbrd/bottom"]
["Forward, bottom lead"]
["weight tape",{"$f":"Trim!$F$87","v":0},null,null,null,null,null,null,null,null,null,null,{"$f":"SUM($C$36:$K$36)","v":0},null,null,{"$f":"$B$36-$M$36","v":0}]
["rubber & tape",{"$f":"Trim!$F$88","v":0},null,null,null,null,null,null,null,null,null,null,{"$f":"SUM($C$37:$K$37)","v":0},null,null,{"$f":"$B$37-$M$37","v":0}]
["All around strap",{"$f":"Trim!$E$90","v":0},null,null,null,null,null,null,null,null,null,null,{"$f":"SUM($C$38:$K$38)","v":0},null,null,{"$f":"$B$38-$M$38","v":0}]
["Total tape",{"$f":"Trim!$E$89","v":2},null,null,null,null,null,null,null,null,null,null,{"$f":"SUM($C$39:$K$39)","v":0},null,null,{"$f":"$B$39-$M$39","v":2}]
[null,null,null,null,null,null,null,null,null,"sum lead",null,null,{"$f":"SUM($M$35:$M$39)","v":0}]
[]
[null,null,null,null,null,null,null,"sum all variable wt.",{"$f":"SUM($M$31,$M$40)","v":595.6}]
[]
[null,"Whole glider weight - BEFORE PUTTING IN TANK or BOX - DRY!!!",null,null,null,null,null,null,{"$f":"total_scale_weight","v":52652.9},"gm"]

{"sheet":"Ballast","index":4,"n_rows":44,"n_cols":17,"rows_kept":44,"cut":false,"hidden":false,"merged":[[7,9,7,10],[37,9,37,10],[9,13,9,14]]}
["Ballasting worksheet",null,{"$f":"Trim!$B$2","v":"SG"},{"$f":"Cal!$D$1","v":512}]
[null,"Date:",{"$f":"NOW()","v":"2016-08-29T14:22:50.640"},"Time:",{"$f":"NOW()","v":"2016-08-29T14:22:50.640"}]
[]
[null,"Conversions",null,"Units"]
["VBD ",{"$f":"1/$B$6","v":-4.0767073250277219},"counts/cc","cc=cm3","gm=grams"]
[null,-0.24529599999999999,"cc/counts","counts=AtoD counts"]
[]
["In tank to find original volume of SG",null,null,null,null,null,null,null,null,"Regression data From Ocean test"]
["Tank Temp",23.3,"deg C","SNUG 25 Mar 2015",null,null,null,null,null,"Mass:",{"$f":"total_scale_weight","v":52652.9}]
["Tank Salinity (meas)",36,"S/m","SNUG 25 Mar 2015",null,null,null,null,null,"Max volume:",null,null,"Max Volume for:",{"$f":"'Lead Worksheet'!$F$2","v":"OCEAN"},null,"xxxxx","cc"]
["Tank Salinity (corr)",36,"ppt",{"$f":"35/36.311","v":0.96389523835752255},"ratio for tank salt",null,null,null,null,"Neutral density:"]
["Tank Density",1.0246,"gram/cc","calculated using web-calculator",null,null,null,null,null,"C_VBD:"]
["SG Mass",53274,"grams","measured with lead est. from orig. trim sheet",null,null,null,"all up scale weight!",null,"C_PITCH:"]
["SG Volume",{"$f":"B13/B12","v":51994.924848721457},"cc","at neutral, when achieved relative to C_VBD",null,null,null,50565,null,"C_ROLL_DIVE:"]
["Neutral by interation in tank",null,0,"cc",null,null,null,null,null,"C_ROLL_CLIMB:"]
["Relative to set C_VBD",null,3059,"counts",null,null,null,null,null,"Nose Wt *"]
["(Neil's table )","counts*","VBD rel V0, cc","Displacement",null,null,null,null,null,"Trim Lead - bottom *"]
["Vol max (oil outside)",{"$f":"Cal!$C$42","v":500},{"$f":"($B$18-$B$19)*$B$6","v":627.71246399999995},{"$f":"$H$14+$C$18","v":51192.712463999997},"cc (pos. floats)",null,null,null,null,"EPDM base - bottom *"]
["Vol neutral",{"$f":"$C$16+($C$15*$B$5)","v":3059},"(obsv in tank)",{"$f":"$H$14","v":50565},"cc",null,null,null,null,"Trim - port side *"]
["Vol min (oil inside)",{"$f":"Cal!$C$43","v":3960},{"$f":"($B$20-$B$19)*$B$6","v":-221.011696},{"$f":"$H$14+$C$20","v":50343.988303999999},"cc (neg. sinks)",null,null,null,null,"EPDM base - port *"]
["Max movable vol.",null,{"$f":"$C$18-$C$20","v":848.72415999999998},null,null,null,null,null,null,"Trim Lead - starboard side *"]
[null,null,null,null,null,null,null,null,null,"EPDM base - starboard *"]
[null,null,null,null,null,null,null,null,null,"Trim Lead- top *"]
[null,null,null,null,null,null,null,null,null,"EPDM base - top *"]
["New enviornment ballasting",null,null,null,null,null,null,null,null,"Trim Lead tape *"]
["SG Mass (observed)",52033,null,"5/17/13 jm",null,null,null,null,null,"(2) Straps *"]
["SG Vol max (obsv/est)",51148,null,"5/17/13 jm",null,null,null,null,null,"(2) black tape wraps over foam *"]
["SG Vol min",{"$f":"$B$27-$C$21","v":50299.275840000002},null,null,null,null,null,null,null,"Trim Lead fwd of bulkhead - bottom *"]
["New enivron density",1.0275000000000001,"g/cc","UH 5/10/13",null,null,null,null,null,"Trim Lead tape *"]
["Goal for thrust",250,"cc","UH",null,null,null,null,null,"EPDM base fwd of bulkhead - bottom *"]
["New Vol neutral ",{"$f":"$B$28+$B$30","v":50549.275840000002},"cc","lead density",11.295999999999999,"gm/cc",null,null,null,"Strap - fwd of bulkhead *"]
["Change mass by",{"$f":"($B$29*$B$31-$B$26)/(1-($B$29/11.296))","v":-102.98690796341167},"gm","vol lead change",{"$f":"$B$32/$E$31","v":-9.1171129571008915},"cc",null,null,null,"Measured Thrust *"]
["Projected new mass",{"$f":"$B$26+$B$32","v":51930.013092036592},"gm",null,null,null,null,null,null,"* - filled in by Macro"]
["Proj. Vol. max",{"$f":"$B$27+$B$32/$E$31","v":51138.882887042899},"cc"]
[]
["VBD points for new environ"]
["(Neil's table )","counts*","VBD rel V0, cc","Displacement"]
["Vol max",{"$f":"Cal!$C$42","v":500},{"$f":"($B$38-$B$39)*$B$6","v":598.72415999999998},{"$f":"$D$39+$C$38+$E$32","v":51138.882887042899},"cc",null,null,null,null,"Customer Environment"]
["Vol neutral (C_VBD)",{"$f":"(($D$39-$B$28)*$B$5)+$B$40","v":2940.8231687430698},0,{"$f":"$B$31","v":50549.275840000002},"cc",null,null,null,null,"Density"]
["Vol min",{"$f":"Cal!$C$43","v":3960},{"$f":"($B$40-$B$39)*$B$6","v":-249.99999999999994},{"$f":"$D$38-($C$38-$C$40)","v":50290.158727042901},"cc",null,null,null,null,"Requested Thrust"]
["Max movable vol.",null,{"$f":"$C$38-$C$40","v":848.72415999999998}]
["Actual new mass",{"$f":"total_scale_weight","v":52652.9},"gm"]
["Est. Vol. neutral",{"$f":"$B$42/$B$29","v":51243.698296836978},"cc"]
["Est. C_VBD",{"$f":"$B$39+($B$43-$D$39)*$B$5","v":109.86605229202496},"counts"]

{"sheet":"Pres cal","index":5,"n_rows":66,"n_cols":6,"rows_kept":66,"cut":false,"hidden":false,"merged":[[61,0,61,1],[22,0,22,5],[42,0,42,2],[43,0,43,1],[49,0,49,1],[49,3,49,4],[59,0,59,3],[60,0,60,2],[13,1,13,2],[13,3,13,4],[4,3,4,4],[5,3,5,4],[6,3,6,4],[9,0,9,1],[11,0,11,1],[12,0,12,1]]}
["Pressure Sensor",null,"last updated","2014-11-03"]
[{"$f":"Trim!$B$2","v":"SG"},{"$f":"Cal!$D$1","v":512}]
["Manufacturer","Paine"]
["Model #","211-75-710-05",null,"Conversion to SG counts"]
["Serial #",{"$f":"'Weight sheet'!$H$470","v":"253669"},null,"A/D Ref Voltage",null,2.4950000000000001]
["Calibration date","2009-08-24",null,"Volts/AD-count",null,1.4871358871460001E-7]
["A/D Gain",128,"(Default value 128 for Paine - 64 for Druck)","A/D Counts/Volt",null,6724335.0701402798]
["Atmos @ cal.",14.7,"(Default value 14.7)","Max counts  (24 bit AD)",null,{"$f":"2^24","v":16777216}]
["Temp @ cal.",0,"(Default value 0)","Excitation Voltage",null,"5.000"]
[]
["Paine calibration data from sheet delivered with sensor"]
["Excitation Voltage = 10.000V"]
["Response voltages in mV"]
["Pressure","0 deg C",null,"30 deg C"]
["(PSIA)","Increasing","Decreasing","Increasing","Decreasing"]
[0,1.019660709013209,1.0314724302825913,0.97703113876905046,0.992691672106502]
[300,7.0374934732924697,7.0476659537571615,6.9945011393475625,7.0169345665783371]
[600,13.039342224370227,13.052,13.004070635233791,13.025]
[900,19.021636182529409,19.034598387701983,18.999834041035125,19.013344107770472]
[1200,24.983939163936896,24.996160113701137,24.975383632577085,24.97939489720774]
[1500,30.936259421424555,null,30.923873297897128]
[]
["Averages of increasing and decreasing and adjusted for Seaglider 5.000V excitation voltage"]
["(PSIA)","Average",null,"Average"]
[0,{"$f":"(($B$16+$C$16)/2)/2","v":0.51278328482395008},null,{"$f":"(($D$16+$E$16)/2)/2","v":0.49243070271888811}]
[300,{"$f":"(($B$17+$C$17)/2)/2","v":3.521289856762408},null,{"$f":"(($D$17+$E$17)/2)/2","v":3.5028589264814749}]
[600,{"$f":"(($B$18+$C$18)/2)/2","v":6.5228355560925566},null,{"$f":"(($D$18+$E$18)/2)/2","v":6.5072676588084484}]
[900,{"$f":"(($B$19+$C$19)/2)/2","v":9.5140586425578491},null,{"$f":"(($D$19+$E$19)/2)/2","v":9.5032945372013984}]
[1200,{"$f":"(($B$20+$C$20)/2)/2","v":12.495024819409508},null,{"$f":"(($D$20+$E$20)/2)/2","v":12.488694632446206}]
[1500,{"$f":"($B$21)/2","v":15.468129710712278},null,{"$f":"($D$21)/2","v":15.461936648948564}]
[]
[]
["0 Deg C",null,"30 Deg C"]
["Pressure","Output","Pressure","Output"]
["(PSIA)","(A/D counts)","(PSIA)","(A/D counts)"]
[0,{"$f":"($B$25*$B$7)*$F$7/1000","v":441360.2080669977},0,{"$f":"($D$25*$B$7)*$F$7/1000","v":423842.43762002455}]
[300,{"$f":"($B$26*$B$7)*$F$7/1000","v":3030826.6081224578},300,{"$f":"($D$26*$B$7)*$F$7/1000","v":3014962.8320119441}]
[600,{"$f":"($B$27*$B$7)*$F$7/1000","v":5614301.6814836673},600,{"$f":"($D$27*$B$7)*$F$7/1000","v":5600902.160501156}]
[900,{"$f":"($B$28*$B$7)*$F$7/1000","v":8188891.9282589396},900,{"$f":"($D$28*$B$7)*$F$7/1000","v":8179627.1025121156}]
[1200,{"$f":"($B$29*$B$7)*$F$7/1000","v":10754653.900214856},1200,{"$f":"($D$29*$B$7)*$F$7/1000","v":10749205.414045528}]
[1500,{"$f":"($B$30*$B$7)*$F$7/1000","v":13313649.546652338},1500,{"$f":"($D$30*$B$7)*$F$7/1000","v":13308319.086183948}]
[]
["Slope Coefficient Units (PSIA/A-D )"]
["Intercept Coefficient (PSIA)"]
["0 Deg C",null,"30 Deg C"]
["Slope",{"$f":"SLOPE($A$36:$A$41,$B$36:$B$41)","v":1.1652685992258822E-4},"Slope",{"$f":"SLOPE($C$36:$C$41,$D$36:$D$41)","v":1.164024201117304E-4}]
["Intercept",{"$f":"INTERCEPT($A$36:$A$41,$B$36:$B$41)","v":-52.941609888241373},"Intercept",{"$f":"INTERCEPT($C$36:$C$41,$D$36:$D$41)","v":-50.787714339559443}]
[]
[]
["Error Analysis 0 Deg",null,null,"Error Analysis 30 Deg"]
["Actual","Calculated","Error","Actual","Calculated","Error"]
["(PSIA)","(PSIA)",null,"(PSIA)","(PSIA)"]
[0,{"$f":"$B$36*$B$46+$B$47","v":-1.5112907474139448},null,0,{"$f":"$D$36*$D$46+$D$47","v":-1.4514288545334608}]
[300,{"$f":"$B$37*$B$46+$B$47","v":300.23109772609746},{"$f":"($A$54-$B$54)/$A$54","v":-7.7032575365819866E-4},300,{"$f":"$D$37*$D$46+$D$47","v":300.16125585354735},{"$f":"($D$54-$E$54)/$D$54","v":-5.3751951182448468E-4}]
[600,{"$f":"$B$38*$B$46+$B$47","v":601.27533571315746},{"$f":"($A$55-$B$55)/$A$55","v":-2.1255595219291006E-3},600,{"$f":"$D$38*$D$46+$D$47","v":601.17085195179459},{"$f":"($D$55-$E$55)/$D$55","v":-1.951419919657648E-3}]
[900,{"$f":"$B$39*$B$46+$B$47","v":901.28425275720144},{"$f":"($A$56-$B$56)/$A$56","v":-1.4269475080016037E-3},900,{"$f":"$D$39*$D$46+$D$47","v":901.34067600435185},{"$f":"($D$56-$E$56)/$D$56","v":-1.4896400048353877E-3}]
[1200,{"$f":"$B$40*$B$46+$B$47","v":1200.2644386580123},{"$f":"($A$57-$B$57)/$A$57","v":-2.2036554834357956E-4},1200,{"$f":"$D$40*$D$46+$D$47","v":1200.4458101334549},{"$f":"($D$57-$E$57)/$D$57","v":-3.715084445457251E-4}]
[1500,{"$f":"$B$41*$B$46+$B$47","v":1498.4561658929456},{"$f":"($A$58-$B$58)/$A$58","v":1.0292227380362723E-3},1500,{"$f":"$D$41*$D$46+$D$47","v":1498.3328349113845},{"$f":"($D$58-$E$58)/$D$58","v":1.111443392410365E-3}]
[]
["Use these values for Seaglider Calibration Coefficients"]
["Slope Coefficient Units (PSIG/A-D )"]
["Intercept Coefficient (PSIG)"]
["0 Deg C",null,null,"30 Deg C"]
["Slope",{"$f":"$B$46","v":1.1652685992258822E-4},null,"Slope",{"$f":"$D$46","v":1.164024201117304E-4}]
["Intercept",{"$f":"$B$47-$B$8","v":-67.641609888241376},null,"Intercept",{"$f":"$E$47-$B$8","v":-14.7}]
["Depth Offset",{"$f":"$B$65*0.685","v":-46.334502773445344},null,"Depth Offset",{"$f":"$E$65*0.685","v":-10.0695}]

{"sheet":"Tank _ PS notes","index":6,"n_rows":4,"n_cols":2,"rows_kept":4,"cut":false,"hidden":false,"merged":[]}
["Tank and Puget Sound Notes"]
["Seaglider",{"$f":"Cal!$D$1","v":512}]
["Date","Action"]
["xx/xx/xx"]

{"sheet":"Maint","index":7,"n_rows":4,"n_cols":2,"rows_kept":4,"cut":false,"hidden":false,"merged":[]}
["Maintenance sheet"]
["MS ",{"$f":"Trim!$C$2","v":512}]
["Date","Action"]
["xx/xx/xx"]

{"sheet":"Motor Data","index":8,"n_rows":8,"n_cols":23,"rows_kept":8,"cut":false,"hidden":false,"merged":[[2,17,2,19],[2,20,2,22]]}
["Motor Data"]
[]
[null,"Main Pump Motor",null,null,null,"Boost Pump motor",null,null,null,"Roll Motor",null,null,null,"Pitch Motor",null,null,null,"Amp w/full mass shifter assy. orientation - nose down, full lift",null,null,"Amp of pitch system during Port Susan dives"]
["MS SN","Burn in time (min):","Amp @ start of burn in (mA):","Amp @ end of burn in (mA):","Amp w/main pump and oil (no load on bench) (mA):","Burn in time (min):","Amp @ start of burn in (mA):","Amp @ end of burn in (mA):","Amp w/micro pump (mA):","Burn in time (min):","Amp @ start of burn in (mA):","Amp @ end of burn in (mA):","Amp w/gear block assy. (mA):","Burn in time (min):","Amp @ start of burn in (mA):","Amp @ end of burn in (mA):","Amp w/gear block assy. (mA):","100-cycle average time (sec):","100-cycle avg. current (mA)","100-cycle avg. current peak  (mA)","Initial flair maneuver (dive start) (mA) ","Surface maneuver (mA)","Apogee maneuver (mid dive) (mA)"]
[{"$f":"'Weight sheet'!$H$332","v":0},30,{"$f":"'Weight sheet'!$F$332","v":0},{"$f":"'Weight sheet'!$G$332","v":0}]
[{"$f":"IF(ISBLANK('Weight sheet'!$H$351),'Weight sheet'!$H$368,'Weight sheet'!$H$351)","v":0},null,null,null,null,30,{"$f":"IF(ISBLANK('Weight sheet'!$F$351),'Weight sheet'!$F$368,'Weight sheet'!$F$351)","v":0},{"$f":"IF(ISBLANK('Weight sheet'!$G$351),'Weight sheet'!$G$368,'Weight sheet'!$G$351)","v":0}]
[{"$f":"'Weight sheet'!$H$468","v":0},null,null,null,null,null,null,null,null,30,{"$f":"'Weight sheet'!$F$468","v":0},{"$f":"'Weight sheet'!$G$468","v":0}]
[{"$f":"'Weight sheet'!$H$467","v":0},null,null,null,null,null,null,null,null,null,null,null,null,30,{"$f":"'Weight sheet'!$F$467","v":0},{"$f":"'Weight sheet'!$G$467","v":0}]

{"sheet":"Material","index":9,"n_rows":26,"n_cols":4,"rows_kept":26,"cut":false,"hidden":false,"merged":[]}
["Material Density","MS",{"$f":"Trim!$C$2","v":512}]
["Date:",{"$f":"NOW()","v":"2016-08-29T14:22:50.640"},"Time:",{"$f":"NOW()","v":"2016-08-29T14:22:50.640"}]
["6061 T6 Alum",2.7130000000000001,"gm/cc"]
["Lead",11.295999999999999,"gm/cc"]
["Naval Brass",8.4149999999999991,"gm/cc"]
["Stainless Steel",8.0269999999999992,"gm/cc"]
["Polypropylene",0.9,"gm/cc"]
["Fairing fiberglass density**",{"$f":"Trim!$M$30","v":1.54565},"gm/cc","From Ross Jan15"]
["  Zinc",7.1,"gm/cc"]
["PVC Density",1.41,"gm/cc"]
["Neoprene Density",1.23,"gm/cc"]
["Hydraulic Oil* Density",0.82289999999999996,"gm/cc"]
["PRC Wing Density",0.67200000000000004,"gm/cc"]
["EPDM sheet density",1.3935999999999999,"gm/cc"]
["Nylon density",1.151,"gm/cc"]
["Polycarbonate",1.21,"gm/cc"]
["Duraform PA w/ Paint",1.0003,"gm/cc"]
["Duraform PA",1,"gm/cc"]
["syntactic foam density",0.42,"gm/cc"]
["Urethane",1.1000000000000001,"gm/cc"]
["Delrin 150",1.42,"gm/cc"]
["HDPE",1.05,"gm/cc"]
[]
[]
["** vary to balance overall density of glider"]
["*Amsoil AWF-ISO15 (synthetic) specfic gravity is 0.8229gm/cc from product sheet 1/23/2009"]

{"sheet":"sg_calib_constants","index":10,"n_rows":166,"n_cols":5,"rows_kept":166,"cut":false,"hidden":true,"merged":[]}
["% Last edited on DATE"]
["% sg_calib_constants.m"]
["% values from spreadsheet for easy inclusion of glider params into diveplot.m, etc."]
[]
["% basic glider and mission params"]
["id_str","='",{"$f":"Cal!$D$1","v":512},"';"]
["mission_title","='",{"$f":"'Lead Worksheet'!$F$2","v":"OCEAN"},"';"]
["mass","=",{"$f":"'Weight sheet'!$H$1/1000","v":52.652000000000001},";","% kg  (from sum on trim sheet)"]
["volmax","=",{"$f":"Ballast!$P$10","v":"xxxxx"},";","% cc  (from ballast worksheet final table)"]
["rho0","=",{"$f":"IF(Ballast!$B$29=0,rho_2*1000,Ballast!$B$29*1000)","v":1027.5},";","% kg/m3 (from ballast worksheet for \"new\" environment)"]
[]
["% initial hydrodynamic model params"]
["hd_a","=",3.836E-3,";"]
["hd_b","=",1.0078E-2,";"]
["hd_c","=",9.8500000000000006E-6,";"]
["therm_expan","=",7.0500000000000006E-5,";"]
["temp_ref","=",15,";"]
["abs_compress","=",4.1799999999999998E-6,";"]
["pitchbias","=",0,";"]
[]
["% software limits from cal sheet:"]
["pitch_min_cnts","=",{"$f":"Cal!$C$12","v":182},";"]
["pitch_max_cnts","=",{"$f":"Cal!$C$13","v":3917},";"]
["roll_min_cnts","=",{"$f":"Cal!$C$27","v":255},";"]
["roll_max_cnts","=",{"$f":"Cal!$C$28","v":3932},";"]
["vbd_min_cnts","=",{"$f":"Cal!$C$42","v":500},";"]
["vbd_max_cnts","=",{"$f":"Cal!$C$43","v":3960},";"]
["vbd_cnts_per_cc","=",{"$f":"Cal!$B$48","v":-4.0767073250277219},";"]
[]
["% pump parameters"]
["pump_rate_intercept","=",1.2749999999999999,";"]
["pump_rate_slope","=",-1.4999999999999999E-4,";"]
["pump_power_intercept","=",17.403300000000002,";"]
["pump_power_slope","=",1.7824E-2,";"]
[]
["% CT sensors cal constants"]
[{"$f":"IF(AND((LEN(Cal!$B$132)=1),Cal!$B$132=0),\"%calibcomm\",\"calibcomm\")","v":"calibcomm"},"='",{"$f":"IF((AND((LEN(Cal!B132)=1),Cal!B132=0)),\"\",\" Serial #: \" & Cal!B132 & \"  CAL: \" &MONTH(Cal!B135)&DAY(Cal!B135)&RIGHT(YEAR(Cal!B135),2))","v":" Serial #: 73  CAL: 123015"},"';","%  Serial # and cal date"]
[{"$f":"IF(AND((LEN(Cal!$B$132)=1),Cal!$B$132=0),\"%t_g\",\"t_g\")","v":"t_g"},"=",{"$f":"Cal!$D$137","v":4.2942334299999997E-3},";"]
[{"$f":"IF(AND((LEN(Cal!$B$132)=1),Cal!$B$132=0),\"%t_h\",\"t_h\")","v":"t_h"},"=",{"$f":"Cal!$D$138","v":6.2847037000000004E-4},";"]
[{"$f":"IF(AND((LEN(Cal!$B$132)=1),Cal!$B$132=0),\"%t_i\",\"t_i\")","v":"t_i"},"=",{"$f":"Cal!$D$139","v":2.3239886599999999E-5},";"]
[{"$f":"IF(AND((LEN(Cal!$B$132)=1),Cal!$B$132=0),\"%t_j\",\"t_j\")","v":"t_j"},"=",{"$f":"Cal!$D$140","v":2.4096663899999998E-6},";"]
[{"$f":"IF(AND((LEN(Cal!$B$132)=1),Cal!$B$132=0),\"%c_g\",\"c_g\")","v":"c_g"},"=",{"$f":"Cal!$B$137","v":-9.7695149600000004},";"]
[{"$f":"IF(AND((LEN(Cal!$B$132)=1),Cal!$B$132=0),\"%c_h\",\"c_h\")","v":"c_h"},"=",{"$f":"Cal!$B$138","v":1.0891893399999999},";"]
[{"$f":"IF(AND((LEN(Cal!$B$132)=1),Cal!$B$132=0),\"%c_i\",\"c_i\")","v":"c_i"},"=",{"$f":"Cal!$B$139","v":7.8893855400000005E-4},";"]
[{"$f":"IF(AND((LEN(Cal!$B$132)=1),Cal!$B$132=0),\"%c_j\",\"c_j\")","v":"c_j"},"=",{"$f":"Cal!$B$140","v":5.7872018800000003E-6},";"]
[{"$f":"IF(AND((LEN(Cal!$B$132)=1),Cal!$B$132=0),\"%cpcor\",\"cpcor\")","v":"cpcor"},"=",{"$f":"Cal!$B$141","v":-9.5700000000000003E-8},";"]
[{"$f":"IF(AND((LEN(Cal!$B$132)=1),Cal!$B$132=0),\"%ctcor\",\"ctcor\")","v":"ctcor"},"=",{"$f":"Cal!$B$142","v":3.2499999999999998E-6},";"]
[{"$f":"IF(AND((LEN(Cal!$B$132)=1),Cal!$B$132=0),\"%sbe_cond_freq_min\",\"sbe_cond_freq_min\")","v":"sbe_cond_freq_min"},"=",{"$f":"Cal!$B$143","v":2.9916100000000001},";","% kHz, from cal for 0 salinity"]
[{"$f":"IF(AND((LEN(Cal!$B$132)=1),Cal!$B$132=0),\"%sbe_cond_freq_max\",\"sbe_cond_freq_max\")","v":"sbe_cond_freq_max"},"=",{"$f":"Cal!$B$144","v":8.0043699999999998},";","% kHz, est for greater than 34.9 sal max T"]
[{"$f":"IF(AND((LEN(Cal!$B$132)=1),Cal!$B$132=0),\"%sbe_temp_freq_min\",\"sbe_temp_freq_min\")","v":"sbe_temp_freq_min"},"=",{"$f":"Cal!$D$143/1000","v":2.9044140000000001},";","% kHz, from cal for 1 deg T"]
[{"$f":"IF(AND((LEN(Cal!$B$132)=1),Cal!$B$132=0),\"%sbe_temp_freq_max\",\"sbe_temp_freq_max\")","v":"sbe_temp_freq_max"},"=",{"$f":"Cal!$D$144/1000","v":5.5653559999999995},";","% kHz, from cal for 32.5 deg T"]
[]
["% oxygen cal constants"]
[{"$f":"IF(AND((LEN(Cal!B203)+(LEN(Cal!B240))=2),(Cal!B203)+((Cal!B240)=0)),\"%comm_oxy_type\",\"comm_oxy_type\")","v":"comm_oxy_type"},"='",{"$f":"IF(AND((LEN(Cal!B203)+(LEN(Cal!B240))=2),((Cal!B203+Cal!B240)=0)),0,IF((Cal!B203>0),\"SBE_43f\",\"Pumped_SBE_43f\"))","v":"SBE_43f"},"';","% spec \"SBE_43f\" or \"Pumped_SBE_43f\""]
[{"$f":"IF(AND((LEN(Cal!B203)+(LEN(Cal!B240))=2),(Cal!B203)+((Cal!B240)=0)),\"%calibcomm_oxygen\",\"calibcomm_oxygen\")","v":"calibcomm_oxygen"},"='",{"$f":"IF((C54)=0,0,IF(Cal!B203=0,(\"SN: \"&Cal!B240&\"  CAL: \"&IF(Cal!D237=0,0,MONTH(Cal!D237))&DAY(Cal!D237)&RIGHT(YEAR(Cal!D237),2)),(\"SN: \"&Cal!B203&\"  CAL: \"&IF(Cal!D200=0,0,MONTH(Cal!D200))&DAY(Cal!D200)&RIGHT(YEAR(Cal!D200),2))))","v":"SN: 0221  CAL: 121815"},"';","%  Serial # and cal date"]
[{"$f":"IF(AND((LEN(Cal!B203)+(LEN(Cal!B240))=2),(Cal!B203)+((Cal!B240)=0)),\"%Soc\",\"Soc\")","v":"Soc"},"=",{"$f":"IF(Cal!$B$203=0,Cal!$D$239,Cal!$D$202)","v":2.5239000000000001E-4},";"]
[{"$f":"IF(AND((LEN(Cal!B203)+(LEN(Cal!B240))=2),(Cal!B203)+((Cal!B240)=0)),\"%Foffset\",\"Foffset\")","v":"Foffset"},"=",{"$f":"IF(Cal!$B$203=0,Cal!$D$243,Cal!$D$206)","v":-826.68},";"]
[{"$f":"IF(AND((LEN(Cal!B203)+(LEN(Cal!B240))=2),(Cal!B203)+((Cal!B240)=0)),\"%o_a\",\"o_a\")","v":"o_a"},"=",{"$f":"IF(Cal!$B$203=0,Cal!$D$244,Cal!$D$207)","v":-4.7269E-3},";"]
[{"$f":"IF(AND((LEN(Cal!B203)+(LEN(Cal!B240))=2),(Cal!B203)+((Cal!B240)=0)),\"%o_b\",\"o_b\")","v":"o_b"},"=",{"$f":"IF(Cal!$B$203=0,Cal!$D$245,Cal!$D$208)","v":2.4573999999999999E-4},";"]
[{"$f":"IF(AND((LEN(Cal!B203)+(LEN(Cal!B240))=2),(Cal!B203)+((Cal!B240)=0)),\"%o_c\",\"o_c\")","v":"o_c"},"=",{"$f":"IF(Cal!$B$203=0,Cal!$D$246,Cal!$D$209)","v":-3.6144999999999999E-6},";"]
[{"$f":"IF(AND((LEN(Cal!B203)+(LEN(Cal!B240))=2),(Cal!B203)+((Cal!B240)=0)),\"%o_e\",\"o_e\")","v":"o_e"},"=",{"$f":"IF(Cal!$B$203=0,Cal!$D$247,Cal!$D$210)","v":3.5999999999999997E-2},";"]
[{"$f":"IF(AND((LEN(Cal!B203)+(LEN(Cal!B240))=2),(Cal!B203)+((Cal!B240)=0)),\"%Tau20\",\"Tau20\")","v":"Tau20"},"=",{"$f":"IF(Cal!$B$203=0,Cal!$D$248,Cal!$D$211)","v":1.54},";"]
[{"$f":"IF(AND((LEN(Cal!B203)+(LEN(Cal!B240))=2),(Cal!B203)+((Cal!B240)=0)),\"%Pcor\",\"Pcor\")","v":"Pcor"},"=",{"$f":"IF(Cal!$B$203=0,Cal!$D$242,Cal!$D$205)","v":"NA"},";"]
[]
["%Aanderaa cal Constants"]
[{"$f":"IF(AND((LEN(Cal!$B$217)=1),(Cal!$B$217)=0),\"%comm_oxy_type\",\"comm_oxy_type\")","v":"comm_oxy_type"},"='",{"$f":"IF(AND((LEN(Cal!$B$217)=1),(Cal!$B$217)=0),0,\"Aa_optode\")","v":"Aa_optode"},"';","% spec  Aa_optode"]
[{"$f":"IF(AND((LEN(Cal!$B$217)=1),(Cal!$B$217)=0),\"%calibcomm_oxygen\",\"calibcomm_oxygen\")","v":"calibcomm_oxygen"},"='",{"$f":"IF(C66=0,0,(\"SN: \"&Cal!B217&\"  CAL: \"&MONTH(Cal!D214))&DAY(Cal!D214)&RIGHT(YEAR(Cal!D214),2))","v":"SN: 199  CAL: 3416"},"';","%  Serial # and cal date"]
[{"$f":"IF(AND((LEN(Cal!$B$217)=1),(Cal!$B$217)=0),\"%optode_FoilCoefA1\",\"optode_FoilCoefA1\")","v":"optode_FoilCoefA1"},"=",{"$f":"Cal!$D$216","v":0},";"]
[{"$f":"IF(AND((LEN(Cal!$B$217)=1),(Cal!$B$217)=0),\"%optode_FoilCoefA2\",\"optode_FoilCoefA2\")","v":"optode_FoilCoefA2"},"=",{"$f":"Cal!$D$217","v":0},";"]
[{"$f":"IF(AND((LEN(Cal!$B$217)=1),(Cal!$B$217)=0),\"%optode_FoilCoefA3\",\"optode_FoilCoefA3\")","v":"optode_FoilCoefA3"},"=",{"$f":"Cal!$D$218","v":0},";"]
[{"$f":"IF(AND((LEN(Cal!$B$217)=1),(Cal!$B$217)=0),\"%optode_FoilCoefA4\",\"optode_FoilCoefA4\")","v":"optode_FoilCoefA4"},"=",{"$f":"Cal!$D$219","v":0},";"]
[{"$f":"IF(AND((LEN(Cal!$B$217)=1),(Cal!$B$217)=0),\"%optode_FoilCoefA5\",\"optode_FoilCoefA5\")","v":"optode_FoilCoefA5"},"=",{"$f":"Cal!$D$220","v":0},";"]
[{"$f":"IF(AND((LEN(Cal!$B$217)=1),(Cal!$B$217)=0),\"%optode_FoilCoefA6\",\"optode_FoilCoefA6\")","v":"optode_FoilCoefA6"},"=",{"$f":"Cal!$D$221","v":0},";"]
[{"$f":"IF(AND((LEN(Cal!$B$217)=1),(Cal!$B$217)=0),\"%optode_FoilCoefA7\",\"optode_FoilCoefA7\")","v":"optode_FoilCoefA7"},"=",{"$f":"Cal!$D$222","v":0},";"]
[{"$f":"IF(AND((LEN(Cal!$B$217)=1),(Cal!$B$217)=0),\"%optode_FoilCoefA8\",\"optode_FoilCoefA8\")","v":"optode_FoilCoefA8"},"=",{"$f":"Cal!$D$223","v":0},";"]
[{"$f":"IF(AND((LEN(Cal!$B$217)=1),(Cal!$B$217)=0),\"%optode_FoilCoefA9\",\"optode_FoilCoefA9\")","v":"optode_FoilCoefA9"},"=",{"$f":"Cal!$D$224","v":0},";"]
[{"$f":"IF(AND((LEN(Cal!$B$217)=1),(Cal!$B$217)=0),\"%optode_FoilCoefA10\",\"optode_FoilCoefA10\")","v":"optode_FoilCoefA10"},"=",{"$f":"Cal!$D$225","v":0},";"]
[{"$f":"IF(AND((LEN(Cal!$B$217)=1),(Cal!$B$217)=0),\"%optode_FoilCoefA11\",\"optode_FoilCoefA11\")","v":"optode_FoilCoefA11"},"=",{"$f":"Cal!$D$226","v":0},";"]
[{"$f":"IF(AND((LEN(Cal!$B$217)=1),(Cal!$B$217)=0),\"%optode_FoilCoefA12\",\"optode_FoilCoefA12\")","v":"optode_FoilCoefA12"},"=",{"$f":"Cal!$D$227","v":0},";"]
[{"$f":"IF(AND((LEN(Cal!$B$217)=1),(Cal!$B$217)=0),\"%optode_FoilCoefA13\",\"optode_FoilCoefA13\")","v":"optode_FoilCoefA13"},"=",{"$f":"Cal!$D$228","v":0},";"]
[{"$f":"IF(AND((LEN(Cal!$B$217)=1),(Cal!$B$217)=0),\"%optode_FoilCoefB1\",\"optode_FoilCoefB1\")","v":"optode_FoilCoefB1"},"=",{"$f":"Cal!$D$229","v":0},";"]
[{"$f":"IF(AND((LEN(Cal!$B$217)=1),(Cal!$B$217)=0),\"%optode_FoilCoefB2\",\"optode_FoilCoefB2\")","v":"optode_FoilCoefB2"},"=",{"$f":"Cal!$D$230","v":0},";"]
[{"$f":"IF(AND((LEN(Cal!$B$217)=1),(Cal!$B$217)=0),\"%optode_FoilCoefB3\",\"optode_FoilCoefB3\")","v":"optode_FoilCoefB3"},"=",{"$f":"Cal!$D$231","v":0},";"]
[{"$f":"IF(AND((LEN(Cal!$B$217)=1),(Cal!$B$217)=0),\"%optode_FoilCoefB4\",\"optode_FoilCoefB4\")","v":"optode_FoilCoefB4"},"=",{"$f":"Cal!$D$232","v":0},";"]
[{"$f":"IF(AND((LEN(Cal!$B$217)=1),(Cal!$B$217)=0),\"%optode_FoilCoefB5\",\"optode_FoilCoefB5\")","v":"optode_FoilCoefB5"},"=",{"$f":"Cal!$D$233","v":0},";"]
[{"$f":"IF(AND((LEN(Cal!$B$217)=1),(Cal!$B$217)=0),\"%optode_FoilCoefB6\",\"optode_FoilCoefB6\")","v":"optode_FoilCoefB6"},"=",{"$f":"Cal!$D$234","v":0},";"]
[]
["%Wetlab Forward or Bump Out cal Constants"]
["%  Chlorophyll cal Constants"]
[{"$f":"IF(AND((LEN(Cal!B151)=1),Cal!B151=0),\"%\" &Cal!A154,Cal!A154)","v":"WETLabsCalData.Chlorophyll.darkCounts"},"=",{"$f":"Cal!$B$154","v":48},";"]
[{"$f":"IF(AND((LEN(Cal!B151)=1),Cal!B151=0),\"%\" &Cal!A155,Cal!A155)","v":"WETLabsCalData.Chlorophyll.scaleFactor"},"=",{"$f":"Cal!$B$155","v":1.18E-2},";"]
[{"$f":"IF(AND((LEN(Cal!B151)=1),Cal!B151=0),\"%\" &Cal!A156,Cal!A156)","v":"WETLabsCalData.Chlorophyll.maxOutput"},"=",{"$f":"Cal!$B$156","v":4130},";"]
[{"$f":"IF(AND((LEN(Cal!B151)=1),Cal!B151=0),\"%\" &Cal!A157,Cal!A157)","v":"WETLabsCalData.Chlorophyll.resolution"},"=",{"$f":"Cal!$B$157","v":1},";"]
[{"$f":"IF(AND((LEN(Cal!B151)=1),Cal!B151=0),\"%\" &Cal!A158,Cal!A158)","v":"WETLabsCalData.Chlorophyll.calTemperature"},"=",{"$f":"Cal!$B$158","v":20},";"]
[]
["%CDOM or Scattering cal Constants"]
[{"$f":"IF(AND((LEN(Cal!B151)=1),Cal!B151=0),\"%\" &Cal!A161,Cal!A161)","v":"WETLabsCalData.CDOM.maxOutput"},"=",{"$f":"Cal!$B$161","v":4130},";"]
[{"$f":"IF(AND((LEN(Cal!B151)=1),Cal!B151=0),\"%\" &Cal!A162,Cal!A162)","v":"WETLabsCalData.CDOM.scaleFactor"},"=",{"$f":"Cal!$B$162","v":6.7699999999999996E-2},";"]
[{"$f":"IF(AND((LEN(Cal!B151)=1),Cal!B151=0),\"%\" &Cal!A163,Cal!A163)","v":"WETLabsCalData.CDOM.darkCounts"},"=",{"$f":"Cal!$B$163","v":28},";"]
[{"$f":"IF(AND((LEN(Cal!B151)=1),Cal!B151=0),\"%\" &Cal!A164,Cal!A164)","v":"WETLabsCalData.CDOM.resolution"},"=",{"$f":"Cal!$B$164","v":1.4},";"]
[{"$f":"IF(AND((LEN(Cal!B151)=1),Cal!B151=0),\"%\" &Cal!A165,Cal!A165)","v":"WETLabsCalData.CDOM.calTemperature"},{"$f":"IF(Cal!$B$160=\"CDOM\",\"=\",\"\")","v":"="},{"$f":"Cal!$B$165","v":20},{"$f":"IF(Cal!$B$160=\"CDOM\",\";\",\"\")","v":";"}]
[]
[{"$f":"\"% \"&Cal!$A$167&\" \" &Cal!$B$167&\" \" &Cal!$C$167","v":"% Scattering Sensor 650 (RED)"}]
[{"$f":"IF(AND((LEN(Cal!B151)=1),Cal!B151=0),\"%\" & Cal!A168,Cal!A168)","v":"WETLabsCalData.Scatter_650.wavelength"},"=",{"$f":"Cal!$B$168","v":"650"},";"]
[{"$f":"IF(AND((LEN(Cal!B151)=1),Cal!B151=0),\"%\" & Cal!A169,Cal!A169)","v":"WETLabsCalData.Scatter_650.scaleFactor"},"=",{"$f":"Cal!$B$169","v":4.5349999999999998E-6},";"]
[{"$f":"IF(AND((LEN(Cal!B151)=1),Cal!B151=0),\"%\" & Cal!A170,Cal!A170)","v":"WETLabsCalData.Scatter_650.darkCounts"},"=",{"$f":"Cal!$B$170","v":42},";"]
[{"$f":"IF(AND((LEN(Cal!B151)=1),Cal!B151=0),\"%\" & Cal!A171,Cal!A171)","v":"WETLabsCalData.Scatter_650.resolution"},"=",{"$f":"Cal!$B$171","v":1.1000000000000001},";"]
[]
["%Wetlab Aft cal Constants"]
["%  Chlorophyll cal Constants"]
[{"$f":"IF(AND((LEN(Cal!B177)=1),Cal!B177=0),\"%\" &Cal!A180,Cal!A180)","v":"WETLabsCalData.Chlorophyll.darkCounts"},"=",{"$f":"Cal!$B$180","v":37},";"]
[{"$f":"IF(AND((LEN(Cal!B177)=1),Cal!B177=0),\"%\" &Cal!A181,Cal!A181)","v":"WETLabsCalData.Chlorophyll.scaleFactor"},"=",{"$f":"Cal!$B$181","v":1.1900000000000001E-2},";"]
[{"$f":"IF(AND((LEN(Cal!B177)=1),Cal!B177=0),\"%\" &Cal!A182,Cal!A182)","v":"WETLabsCalData.Chlorophyll.maxOutput"},"=",{"$f":"Cal!$B$182","v":4140},";"]
[{"$f":"IF(AND((LEN(Cal!B177)=1),Cal!B177=0),\"%\" &Cal!A183,Cal!A183)","v":"WETLabsCalData.Chlorophyll.resolution"},"=",{"$f":"Cal!$B$183","v":1.7},";"]
[{"$f":"IF(AND((LEN(Cal!B177)=1),Cal!B177=0),\"%\" &Cal!A184,Cal!A184)","v":"WETLabsCalData.Chlorophyll.calTemperature"},"=",{"$f":"Cal!$B$184","v":22.3},";"]
[]
[]
["%CDOM or Scattering cal Constants"]
[{"$f":"IF(AND((LEN(Cal!B177)=1),Cal!B177=0),\"%\" &Cal!A187,Cal!A187)","v":"WETLabsCalData.Scatter_470.wavelength"},"=",{"$f":"Cal!$B$187","v":"470"},";"]
[{"$f":"IF(AND((LEN(Cal!B177)=1),Cal!B177=0),\"%\" &Cal!A188,Cal!A188)","v":"WETLabsCalData.Scatter_470.scaleFactor"},"=",{"$f":"Cal!$B$188","v":1.081E-5},";"]
[{"$f":"IF(AND((LEN(Cal!B177)=1),Cal!B177=0),\"%\" &Cal!A189,Cal!A189)","v":"WETLabsCalData.Scatter_470.darkCounts"},"=",{"$f":"Cal!$B$189","v":45},";"]
[{"$f":"IF(AND((LEN(Cal!B177)=1),Cal!B177=0),\"%\" &Cal!A190,Cal!A190)","v":"WETLabsCalData.Scatter_470.resolution"},"=",{"$f":"Cal!$B$190","v":1},";"]
[{"$f":"IF(AND((LEN(Cal!B177)=1),Cal!B177=0),\"%\" &Cal!A191,Cal!A191)","v":""},{"$f":"IF(Cal!$B$186=\"CDOM\",\"=\",\"\")","v":""},{"$f":"Cal!$B$191","v":0},{"$f":"IF(Cal!$B$186=\"CDOM\",\";\",\"\")","v":""}]
[]
[{"$f":"\"% \"&Cal!$A$193&\" \" &Cal!$B$193&\" \" &Cal!$C$193","v":"% Scattering Sensor 700 None"}]
[{"$f":"IF(AND((LEN(Cal!B177)=1),Cal!B177=0),\"%\" & Cal!A194,Cal!A194)","v":"WETLabsCalData.Scatter_700.wavelength"},"=",{"$f":"Cal!$B$194","v":"700"},";"]
[{"$f":"IF(AND((LEN(Cal!B177)=1),Cal!B177=0),\"%\" & Cal!A195,Cal!A195)","v":"WETLabsCalData.Scatter_700.scaleFactor"},"=",{"$f":"Cal!$B$195","v":3.0029999999999999E-6},";"]
[{"$f":"IF(AND((LEN(Cal!B177)=1),Cal!B177=0),\"%\" & Cal!A196,Cal!A196)","v":"WETLabsCalData.Scatter_700.darkCounts"},"=",{"$f":"Cal!$B$196","v":53},";"]
[{"$f":"IF(AND((LEN(Cal!B177)=1),Cal!B177=0),\"%\" & Cal!A197,Cal!A197)","v":"WETLabsCalData.Scatter_700.resolution"},"=",{"$f":"Cal!$B$197","v":1.2},";"]
[]
["% PAR Calibration Constants and Device Properties"]
[{"$f":"IF(AND((LEN(Cal!$B$261)=1),Cal!$B$261=0),\"%PAR_CalData.manufacturer\",\"PAR_CalData.manufacturer\")","v":"%PAR_CalData.manufacturer"},"='",{"$f":"Cal!$B$260","v":"Biospherical Instruments, Inc"},"';","% Manufacturer"]
[{"$f":"IF(AND((LEN(Cal!$B$261)=1),Cal!$B$261=0),\"%PAR_CalData.serialNumber\",\"PAR_CalData.serialNumber\")","v":"%PAR_CalData.serialNumber"},"='",{"$f":"Cal!$B$261","v":0},"';","%  Serial #"]
[{"$f":"IF(AND((LEN(Cal!$B$261)=1),Cal!$B$261=0),\"%PAR_CalData.calData\",\"PAR_CalData.calData\")","v":"%PAR_CalData.calData"},"='",{"$f":"Cal!$B$262","v":"xx/xx/xx"},"';","% cal date"]
[{"$f":"IF(AND((LEN(Cal!$B$261)=1),Cal!$B$261=0),\"%PAR_CalData.sensorDark\",\"PAR_CalData.sensorDark\")","v":"%PAR_CalData.sensorDark"},"=",{"$f":"Cal!$D$263","v":0},";","% mv"]
[{"$f":"IF(AND((LEN(Cal!$B$261)=1),Cal!$B$261=0),\"%PAR_CalData.scalingFactor\",\"PAR_CalData.scalingFactor\")","v":"%PAR_CalData.scalingFactor"},"=",{"$f":"Cal!$D$264","v":0},";","% Volts/uE/cm^2sec"]
[]
["% Radiation Calibration Constants and Device Properties"]
[{"$f":"IF(AND((LEN(Cal!$B$270)=1),Cal!$B$270=0),\"%RAD_CalData.manufacturer\",\"RAD_CalData(1).manufacturer\")","v":"%RAD_CalData.manufacturer"},"='",{"$f":"Cal!$B$269","v":"Princeton Gamma Tech"},"';","% Manufacturer"]
[{"$f":"IF(AND((LEN(Cal!$B$270)=1),Cal!$B$270=0),\"%RAD_CalData.serialNumber\",\"RAD_CalData.serialNumber\")","v":"%RAD_CalData.serialNumber"},"='",{"$f":"Cal!$B$270","v":0},"';","%  Serial #"]
[{"$f":"IF(AND((LEN(Cal!$B$270)=1),Cal!$B$270=0),\"%RAD_CalData.calData\",\"RAD_CalData.calData\")","v":"%RAD_CalData.calData"},"='",{"$f":"Cal!$B$271","v":"xx/xx/xx"},"';","% cal date"]
[]
["%Nortek ADCP Sensor cal Constants"]
[{"$f":"IF(AND((LEN(Cal!$B$277)=1),Cal!$B$277=0),\"%?\",\"?\")","v":"%?"},"=",{"$f":"Cal!$D$279","v":0},";"]
[{"$f":"IF(AND((LEN(Cal!$B$277)=1),Cal!$B$277=0),\"%?\",\"?\")","v":"%?"},"=",{"$f":"Cal!$D$280","v":0},";"]
[{"$f":"IF(AND((LEN(Cal!$B$277)=1),Cal!$B$277=0),\"%?\",\"?\")","v":"%?"},"=",{"$f":"Cal!$D$281","v":0},";"]
[]
["%Imagenex ECHOSounder Sensor cal Constants"]
[{"$f":"IF(AND((LEN(Cal!$B$285)=1),Cal!$B$285=0),\"%?\",\"?\")","v":"%?"},"=",{"$f":"Cal!$D$287","v":0},";"]
[{"$f":"IF(AND((LEN(Cal!$B$285)=1),Cal!$B$285=0),\"%?\",\"?\")","v":"%?"},"=",{"$f":"Cal!$D$288","v":0},";"]
[{"$f":"IF(AND((LEN(Cal!$B$285)=1),Cal!$B$285=0),\"%?\",\"?\")","v":"%?"},"=",{"$f":"Cal!$D$289","v":0},";"]
[]
["%RAFOS cal Constants"]
[{"$f":"IF(AND((LEN(Cal!$B$293)=1),Cal!$B$293=0),\"%?\",\"?\")","v":"%?"},"=",{"$f":"Cal!$D$295","v":0},";"]
[{"$f":"IF(AND((LEN(Cal!$B$293)=1),Cal!$B$293=0),\"%?\",\"?\")","v":"%?"},"=",{"$f":"Cal!$D$296","v":0},";"]
[{"$f":"IF(AND((LEN(Cal!$B$293)=1),Cal!$B$293=0),\"%?\",\"?\")","v":"%?"},"=",{"$f":"Cal!$D$297","v":0},";"]
[]
["%New Sensor #1 cal Constants"]
[{"$f":"IF(AND((LEN(Cal!$B$301)=1),Cal!$B$301=0),\"%?\",\"?\")","v":"%?"},"=",{"$f":"Cal!$D$303","v":0},";"]
[{"$f":"IF(AND((LEN(Cal!$B$301)=1),Cal!$B$301=0),\"%?\",\"?\")","v":"%?"},"=",{"$f":"Cal!$D$304","v":0},";"]
[{"$f":"IF(AND((LEN(Cal!$B$301)=1),Cal!$B$301=0),\"%?\",\"?\")","v":"%?"},"=",{"$f":"Cal!$D$305","v":0},";"]
[]
["%New Sensor #2 cal Constants"]
[{"$f":"IF(AND((LEN(Cal!$B$309)=1),Cal!$B$309=0),\"%?\",\"?\")","v":"%?"},"=",{"$f":"Cal!$D$311","v":0},";"]
[{"$f":"IF(AND((LEN(Cal!$B$309)=1),Cal!$B$309=0),\"%?\",\"?\")","v":"%?"},"=",{"$f":"Cal!$D$312","v":0},";"]
[{"$f":"IF(AND((LEN(Cal!$B$309)=1),Cal!$B$309=0),\"%?\",\"?\")","v":"%?"},"=",{"$f":"Cal!$D$313","v":0},";"]

{"sheet":"CMDFILE","index":11,"n_rows":57,"n_cols":5,"rows_kept":57,"cut":false,"hidden":true,"merged":[]}
["$C_PITCH,",{"$f":"Cal!$C$15","v":2768}]
["$C_ROLL_CLIMB,",{"$f":"Cal!$C$30","v":2030}]
["$C_ROLL_DIVE,",{"$f":"Cal!$C$29","v":2050}]
["$C_VBD,",{"$f":"Cal!$C$45","v":2898.9766245619844}]
["$D_TGT,",30]
["$MASS,",{"$f":"sg_calib_constants!$C$8*1000","v":52652}]
["$MAX_BUOY,",5]
["$PITCH_GAIN,",30]
["$RHO,",{"$f":"sg_calib_constants!$C$10/1000","v":1.0275000000000001}]
["$SM_CC,",150]
["$T_DIVE,",10]
["$T_MISSION,",15]
["$AH0_10V,",0,"<-------------","---|----------","Delete Comments in columns C, D, & F."]
["$AH0_24V,",350,"<-------------","---|----------","For a 15V system: $AH0_10V,0 & $AH0_24V,350"]
["$ALTIM_PING_DELTA,",5,null,null,"For a 10/24V system: $AH0_10V,95 & $AH0_24V,145"]
["$ALTIM_PING_DEPTH,",80]
["$D_NO_BLEED,",29]
["$D_SURF,",3]
["$KALMAN_USE,",2]
["$NAV_MODE,",2]
["$PITCH_AD_RATE,",175]
["$PITCH_CNV,",{"$f":"Cal!$B$17","v":3.1257631257631258E-3}]
["$PITCH_MAX,",{"$f":"Cal!$C$13","v":3917}]
["$PITCH_MIN,",{"$f":"Cal!$C$12","v":182}]
["$PITCH_TIMEOUT,",17]
["$PRESSURE_SLOPE,",{"$f":"Cal!$B$62","v":1.1652685992258822E-4}]
["$ROLL_AD_RATE,",350]
["$ROLL_CNV,",{"$f":"Cal!$B$32","v":2.827E-2}]
["$ROLL_MAX,",{"$f":"Cal!$C$28","v":3932}]
["$ROLL_MIN,",{"$f":"Cal!$C$27","v":255}]
["$SEABIRD_C_G,",{"$f":"IF(Cal!$B$137=0,-11,Cal!$B$137)","v":-9.7695149600000004}]
["$SEABIRD_C_H,",{"$f":"IF(Cal!$B$138=0,0.6,Cal!$B$138)","v":1.0891893399999999}]
["$SEABIRD_C_I,",{"$f":"IF(Cal!$B$139=0,-0.0014,Cal!$B$139)","v":7.8893855400000005E-4}]
["$SEABIRD_C_J,",{"$f":"IF(Cal!$B$140=0,0.0001,Cal!$B$140)","v":5.7872018800000003E-6}]
["$SEABIRD_T_G,",{"$f":"IF(Cal!$D$137=0,0.004,Cal!$D$137)","v":4.2942334299999997E-3}]
["$SEABIRD_T_H,",{"$f":"IF(Cal!$D$138=0,0.0006,Cal!$D$138)","v":6.2847037000000004E-4}]
["$SEABIRD_T_I,",{"$f":"IF(Cal!$D$139=0,0.000024,Cal!$D$139)","v":2.3239886599999999E-5}]
["$SEABIRD_T_J,",{"$f":"IF(Cal!$D$140=0,0.0000026,Cal!$D$140)","v":2.4096663899999998E-6}]
["$T_GPS,",5]
["$T_NO_W,",120]
["$T_RSLEEP,",3]
["$T_TURN_SAMPINT,",5]
["$USE_BATHY,",0]
["$VBD_CNV,",{"$f":"Cal!$B$47","v":-0.24529599999999999}]
["$VBD_MAX,",{"$f":"Cal!$C$43","v":3960}]
["$VBD_MIN,",{"$f":"Cal!$C$42","v":500}]
["$VBD_PUMP_AD_RATE_SURFACE,",5]
["$VBD_TIMEOUT,",720]
["$XPDR_VALID,",2]
["$XPDR_INHIBIT,",90]
["$LOGGERS,",1,"<-------------","---|"]
["$PC_RECORDABOVE,",1000,null,"   |"]
["$PC_PROFILE,",3,null,"   |-----------","Delete these lines if CTD not installed. If installed delete Comments in columns C, D, & F."]
["$PC_XMITPROFILE,",3,null,"   |"]
["$PC_UPLOADMAX,",1000000,null,"   |"]
["$PC_INTERVAL,",1,"<-------------","---|"]
["$QUIT"]

{"sheet":"PRM","index":12,"n_rows":178,"n_cols":3,"rows_kept":178,"cut":false,"hidden":true,"merged":[]}
["$ID,",{"$f":"'Weight sheet'!$C$1","v":512}]
["$MISSION,",0]
["$DIVE,",0]
["$N_DIVES,",0]
["$D_SURF,",3]
["$D_FLARE,",3]
["$D_TGT,",30]
["$D_ABORT,",300]
["$D_NO_BLEED,",29]
["$D_BOOST,",0]
["$T_BOOST,",0]
["$D_FINISH,",0]
["$D_PITCH,",0]
["$D_SAFE,",0]
["$D_CALL,",0]
["$SURFACE_URGENCY,",0]
["$SURFACE_URGENCY_TRY,",0]
["$SURFACE_URGENCY_FORCE,",0]
["$T_DIVE,",10]
["$T_MISSION,",15]
["$T_ABORT,",720]
["$T_TURN,",225]
["$T_TURN_SAMPINT,",5]
["$T_NO_W,",120]
["$T_LOITER,",0]
["$T_EPIRB,",0]
["$USE_BATHY,",0]
["$USE_ICE,",0]
["$ICE_FREEZE_MARGIN,",0.30000000999999998]
["$D_OFFGRID,",100]
["$T_WATCHDOG,",10]
["$RELAUNCH,",0]
["$APOGEE_PITCH,",-5]
["$MAX_BUOY,",5]
["$COURSE_BIAS,",0]
["$GLIDE_SLOPE,",30]
["$SPEED_FACTOR,",1]
["$RHO,",{"$f":"rho_2","v":1.0275000000000001},"(set number to value glider ballasted to)"]
["$MASS,",{"$f":"Trim!$C$10/1000","v":52.652900000000002},"(set number to value found on trim sheet, C10 of Trim tab) "]
["$MASS_COMP,",0]
["$NAV_MODE,",2]
["$FERRY_MAX,",45]
["$KALMAN_USE,",2]
["$HD_A,",3.836E-3]
["$HD_B,",1.0078E-2]
["$HD_C,",9.8500000000000006E-6]
["$HEADING,",-1]
["$ESCAPE_HEADING,",0]
["$ESCAPE_HEADING_DELTA,",10]
["$FIX_MISSING_TIMEOUT,",0]
["$TGT_DEFAULT_LAT,",4743,"(set to default latitude specific to deployment site)"]
["$TGT_DEFAULT_LON,",-12223.5,"(set to default longitude specific to deployment site)"]
["$TGT_AUTO_DEFAULT,",0]
["$SM_CC,",150]
["$N_FILEKB,",4]
["$FILEMGR,",0]
["$CALL_NDIVES,",1]
["$COMM_SEQ,",0]
["$PROTOCOL,",0]
["$N_NOCOMM,",1]
["$NOCOMM_ACTION,",0]
["$N_NOSURFACE,",0]
["$UPLOAD_DIVES_MAX,",-1]
["$CALL_TRIES,",5]
["$CALL_WAIT,",60]
["$CAPUPLOAD,",1]
["$CAPMAXSIZE,",100000]
["$HEAPDBG,",0]
["$T_GPS,",5]
["$N_GPS,",20]
["$T_GPS_ALMANAC,",0]
["$T_GPS_CHARGE,",-1476.4033999999999]
["$T_RSLEEP,",3]
["$STROBE,",0]
["$RAFOS_PEAK_OFFSET,",1.5]
["$RAFOS_CORR_THRESH,",60]
["$RAFOS_HIT_WINDOW,",3600]
["$PITCH_MIN,",{"$f":"Cal!$C$12","v":182},"(glider specific, obtain from Cal Tab of trim sheet)"]
["$PITCH_MAX,",{"$f":"Cal!$C$13","v":3917},"(glider specific, obtain from Cal Tab of trim sheet)"]
["$C_PITCH,",{"$f":"Cal!$C$15","v":2768},"(glider specific, obtain from Cal Tab of trim sheet)"]
["$PITCH_DBAND,",0.1]
["$PITCH_CNV,",3.1257630000000002E-3]
["$P_OVSHOOT,",7.9999998000000003E-2]
["$PITCH_GAIN,",30]
["$PITCH_TIMEOUT,",18]
["$PITCH_AD_RATE,",160]
["$PITCH_MAXERRORS,",1]
["$PITCH_ADJ_GAIN,",0]
["$PITCH_ADJ_DBAND,",0]
["$ROLL_MIN,",{"$f":"Cal!$C$27","v":255},"(glider specific, obtain from Cal Tab of trim sheet)"]
["$ROLL_MAX,",{"$f":"Cal!$C$28","v":3932},"(glider specific, obtain from Cal Tab of trim sheet)"]
["$ROLL_DEG,",40]
["$C_ROLL_DIVE,",{"$f":"Cal!$C$29","v":2050},"(glider specific, obtain from Cal Tab of trim sheet)"]
["$C_ROLL_CLIMB,",{"$f":"Cal!$C$30","v":2030},"(glider specific, obtain from Cal Tab of trim sheet)"]
["$HEAD_ERRBAND,",10]
["$ROLL_CNV,",2.8270000999999999E-2]
["$ROLL_TIMEOUT,",15]
["$R_PORT_OVSHOOT,",25,"(leave as set in the Self Test .log file)"]
["$R_STBD_OVSHOOT,",25,"(leave as set in the Self Test .log file)"]
["$ROLL_AD_RATE,",350]
["$ROLL_MAXERRORS,",1]
["$ROLL_ADJ_GAIN,",0]
["$ROLL_ADJ_DBAND,",0]
["$VBD_MIN,",{"$f":"Cal!$C$42","v":500},"(glider specific, obtain from Cal Tab of trim sheet)"]
["$VBD_MAX,",{"$f":"Cal!$C$43","v":3960},"(glider specific, obtain from Cal Tab of trim sheet)"]
["$C_VBD,",{"$f":"Cal!$C$45","v":2898.9766245619844},"(glider specific, obtain from Cal Tab of trim sheet)"]
["$VBD_DBAND,",2]
["$VBD_CNV,",-0.24529999]
["$VBD_TIMEOUT,",720]
["$PITCH_VBD_SHIFT,",1.2300001E-3]
["$VBD_PUMP_AD_RATE_SURFACE,",5]
["$VBD_PUMP_AD_RATE_APOGEE,",4]
["$VBD_BLEED_AD_RATE,",8]
["$UNCOM_BLEED,",60]
["$VBD_MAXERRORS,",1]
["$W_ADJ_DBAND,",0]
["$DBDW,",0]
["$PITCH_W_GAIN,",0]
["$PITCH_W_DBAND,",0]
["$CF8_MAXERRORS,",20]
["$AH0_24V,",{"$f":"CMDFILE!$B$14","v":350},"(use 145 for 24V systems and 350 for 15V systems)"]
["$AH0_10V,",{"$f":"CMDFILE!$B$13","v":0},"(use 95 for 10V systems and 0 for 15V systems)"]
["$MINV_24V,",11.5,"(use 19 for 24V systems and 11.5V for 15V systems)"]
["$MINV_10V,",11.5,"(use 8.2 for 24V systems and 11.5V for 15V systems)"]
["$FG_AHR_10V,",0]
["$FG_AHR_24V,",0]
["$PHONE_SUPPLY,",2]
["$PRESSURE_YINT,",-49.106464000000003]
["$PRESSURE_SLOPE,",{"$f":"'Pres cal'!$B$64","v":1.1652685992258822E-4},"(glider specific, obtain from Press cal Tab of trim sheet)"]
["$AD7714Ch0Gain,",128]
["$TCM_PITCH_OFFSET,",0]
["$TCM_ROLL_OFFSET,",0]
["$COMPASS_USE,",0]
["$ALTIM_BOTTOM_PING_RANGE,",0]
["$ALTIM_TOP_PING_RANGE,",0]
["$ALTIM_BOTTOM_TURN_MARGIN,",0]
["$ALTIM_TOP_TURN_MARGIN,",0]
["$ALTIM_TOP_MIN_OBSTACLE,",1]
["$ALTIM_PING_DEPTH,",80]
["$ALTIM_PING_DELTA,",5]
["$ALTIM_FREQUENCY,",13]
["$ALTIM_PULSE,",3]
["$ALTIM_SENSITIVITY,",2]
["$XPDR_VALID,",2]
["$XPDR_INHIBIT,",90]
["$INT_PRESSURE_SLOPE,",9.7660002999999992E-3]
["$INT_PRESSURE_YINT,",0]
["$DEEPGLIDER,",0]
["$DEEPGLIDERMB,",0]
["$MOTHERBOARD,",4]
["$DEVICE1,",2]
["$DEVICE2,",-1]
["$DEVICE3,",-1]
["$DEVICE4,",-1]
["$DEVICE5,",-1]
["$DEVICE6,",-1]
["$LOGGERS,",0]
["$LOGGERDEVICE1,",-1]
["$LOGGERDEVICE2,",-1]
["$LOGGERDEVICE3,",-1]
["$LOGGERDEVICE4,",-1]
["$COMPASS_DEVICE,",33]
["$COMPASS2_DEVICE,",-1]
["$PHONE_DEVICE,",48]
["$GPS_DEVICE,",32]
["$RAFOS_DEVICE,",-1]
["$XPDR_DEVICE,",24]
["$SIM_W,",0.1]
["$SIM_PITCH,",-20]
["$SEABIRD_T_G,",{"$f":"Cal!$D$137","v":4.2942334299999997E-3},"(glider specific, obtain from Cal Tab of trim sheet)"]
["$SEABIRD_T_H,",{"$f":"Cal!$D$138","v":6.2847037000000004E-4},"(glider specific, obtain from Cal Tab of trim sheet)"]
["$SEABIRD_T_I,",{"$f":"Cal!$D$139","v":2.3239886599999999E-5},"(glider specific, obtain from Cal Tab of trim sheet)"]
["$SEABIRD_T_J,",{"$f":"Cal!$D$140","v":2.4096663899999998E-6},"(glider specific, obtain from Cal Tab of trim sheet)"]
["$SEABIRD_C_G,",{"$f":"Cal!$B$137","v":-9.7695149600000004},"(glider specific, obtain from Cal Tab of trim sheet)"]
["$SEABIRD_C_H,",{"$f":"Cal!$B$138","v":1.0891893399999999},"(glider specific, obtain from Cal Tab of trim sheet)"]
["$SEABIRD_C_I,",{"$f":"Cal!$B$139","v":7.8893855400000005E-4},"(glider specific, obtain from Cal Tab of trim sheet)"]
["$SEABIRD_C_J,",{"$f":"Cal!$B$140","v":5.7872018800000003E-6},"(glider specific, obtain from Cal Tab of trim sheet)"]
["$QUIT"]

{"sheet":"As Built SN#s","index":13,"n_rows":69,"n_cols":32,"rows_kept":69,"cut":false,"hidden":false,"merged":[[12,3,12,6],[13,3,13,6],[14,3,14,6],[15,3,15,6],[4,3,4,6],[5,3,5,6],[6,3,6,6],[7,3,7,6],[11,3,11,6],[52,3,52,6],[51,3,51,6],[27,3,27,6],[16,3,16,6],[17,3,17,6],[18,3,18,6],[19,3,19,6],[20,3,20,6],[21,3,21,6],[22,3,22,6],[23,3,23,6],[24,3,24,6],[25,3,25,6],[26,3,26,6],[47,3,47,6],[28,3,28,6],[29,3,29,6],[30,3,30,6],[31,3,31,6],[34,3,34,6],[38,3,38,6],[37,3,37,6],[39,3,39,6],[40,3,40,6],[41,3,41,6],[45,3,45,6],[46,3,46,6],[68,3,68,6],[48,3,48,6],[49,3,49,6],[50,3,50,6],[53,3,53,6],[54,3,54,6],[62,3,62,6],[63,3,63,6],[64,3,64,6],[65,3,65,6],[66,3,66,6],[67,3,67,6],[55,3,55,6],[56,3,56,6],[57,3,57,6],[58,3,58,6]]}
[null,"Unit # MS:",{"$error":"#NAME?"}]
[]
[]
[null,"System"]
["Item","Description","Serial Number","Comments"]
[4192452,"CTO Model,System,Seaglider 1K",{"$f":"'Weight sheet'!$C$63","v":"??"}]
[4197060,"KIT, SEAGLIDER - TTI",{"$f":"'Weight sheet'!$C$1","v":512}]
["4197060-00001","KIT, SEAGLIDER 1KA",{"$f":"'Weight sheet'!$C$1","v":512}]
[]
[]
[null,"Hull Parts:"]
["Item","Description","Serial Number","Comments"]
[4199360,"ASSY, CABLE - PRESSURE SENSOR - A1W12 (Paine)",{"$f":"'Weight sheet'!$H$470","v":"253669"}]
[4199485,"ASSY, BATTERY PACK - LITHIUM 24VDC ",{"$f":"'Weight sheet'!$H$469","v":"1600007"}]
[4199484,"ASSY, BATTERY PACK - LITHIUM, 10VDC ",{"$f":"'Weight sheet'!$H$508","v":"1600012"}]
[4197562,"MOTOR, PITCH/ROLL  (Pitch)",{"$f":"'Weight sheet'!$H$467","v":0}]
[4197562,"MOTOR, PITCH/ROLL (Roll)",{"$f":"'Weight sheet'!$H$468","v":0}]
[4199399,"PUMP, HYDRAULIC - 3 PISTON, .045ccm, 300 bar @ 5000 RPM  (Main Pump)",{"$f":"'Weight sheet'!$H$332","v":0}]
[4199366,"ASSY, CABLE - PUMP MOTOR, VBD HIGH PRESSURE - A11W18  (Standard Boost Pump)",{"$f":"'Weight sheet'!$H$351","v":0}]
[4261167,"ASSY, CABLE, MOTOR, BOOST PUMP HIGH VOL  (High Vol Boost Pump)",{"$f":"'Weight sheet'!$H$368","v":0}]
[4307143,"ASSY, MAIN BOARD ",{"$f":"'Weight sheet'!$H$485","v":"92450012"}]
[4199040,"Computer Supply,Microcontroller,Tattletale 8v2,1MB SRAM,RoHS  (TT8)",{"$f":"'Weight sheet'!$H$486","v":"2422137"}]
[4199041,"ADAPTER, COMPACTFLASH, FOR TATTLETALE 8V2 ",{"$f":"'Weight sheet'!$H$487","v":"2590"}]
[4297019,"Card,Memory,Compact Flash,2GB,-40to+85C,RoHS",{"$f":"'Weight sheet'!$H$487","v":"2590"}]
[4199419,"PCBA, AFT TERMINAL",{"$f":"'Weight sheet'!$H$437","v":0}]
[4199370,"ASSY, OEM NAVIGATION",{"$f":"'Weight sheet'!$H$492","v":0}]
[4199038,"PCBA, TRANSPONDER & ALTIMETER",{"$f":"'Weight sheet'!$H$495","v":"193"}]
[4199036,"TRANSPONDER - UNDERWATER COMMUNICATIONS TRANSDUCER",{"$f":"'Weight sheet'!$H$530","v":5190}]
[4246794,"MODEM, L-BAND TRANSCEIVER - IRIDIUM",{"$f":"'Weight sheet'!$H$501","v":"707XL8"}]
["-","Modem IMEI:",{"$f":"'Weight sheet'!$H$502","v":"300224010849200"}]
[4215968,"SIM CARD, SEAGLIDER",{"$f":"'Weight sheet'!$H$503","v":"8988169224000233297"}]
[4199374,"ASSY, CABLE - RF RELAY CONTROL - A1W27 (RF Switch)",{"$f":"'Weight sheet'!$H$504","v":0}]
[4199420,"PCBA, SPARTON COMPASS CARRIER",{"$f":"'Weight sheet'!$H$538","v":91880010}]
[4205793,"COMPASS, DIGITAL - 3-AXIS, TILT COMPENSATED, SPARTON, ROHS",{"$f":"'Weight sheet'!$H$539","v":"K887"}]
[4199332,"ASSY, ANTENNA, GPSI",{"$f":"'Weight sheet'!$H$104","v":"ES-140"}]
[]
[null,"Sensors:"]
["Item","Description","Serial Number","Comments",null,null,null,null,null,null,null,null,null,null,null,null,null,null,null,null,null,null,null,null,null,null,"WetLab table"]
[4199407,"ASSY, SBE SAIL, CONDUCTIVITY - TEMPERATURE (CT-Sail)",{"$f":"'Weight sheet'!$H$452","v":"0073"}]
[4196239,"KIT, OPTICAL SENSOR, DISSOLVED O2 - AANDERAA 4330",{"$f":"'Weight sheet'!$H$110","v":"199"},null,null,null,null,null,null,null,null,null,null,null,null,null,null,null,null,null,null,null,null,null,null,null,"Freq 1","Freq 2","Freq 3","Vlookup code","Part Number","Description"]
[4199047,"SENSOR, OXYGEN, SBE - FREE FLOW",{"$f":"'Weight sheet'!$H$116","v":"0221"},null,null,null,null,null,null,null,null,null,null,null,null,null,null,null,null,null,null,null,null,null,null,null,"CHL A","CDOM",532,{"$f":"$AA$41&$AB$41&$AC$41","v":"CHL ACDOM532"},4273157,"KIT, SENSOR, FLUOROMETER-WET LABS BBFL2-VMT (532/CHL/CDOM)"]
[4199436,"PCBA, OXYGEN SENSOR",{"$f":"'Weight sheet'!$H$445","v":0},null,null,null,null,null,null,null,null,null,null,null,null,null,null,null,null,null,null,null,null,null,null,null,"CHL A","CDOM",650,{"$f":"$AA$42&$AB$42&$AC$42","v":"CHL ACDOM650"},4199039,"SENSOR, BACKSCATTER/FLUOROMETER - 650, CHL, CDOM"]
[null,null,null,"Wetlab Model","freq 1","Freq 2","Freq 3",null,null,null,null,null,null,null,null,null,null,null,null,null,null,null,null,null,null,null,"CHL A",470,700,{"$f":"$AA$43&$AB$43&$AC$43","v":"CHL A470700"},4249861,"KIT, SENSOR, FLUOROMETER-WET LABS BB2FL-VMT (470/700/CHL-A)"]
[{"$f":"IF(ISNA(VLOOKUP($E$44&$F$44&$G$44,$AD$41:$AF$48,2,FALSE)),\"\",(VLOOKUP($E$44&$F$44&$G$44,$AD$41:$AF$48,2,FALSE)))","v":""},{"$f":"IF(ISNA(VLOOKUP($E$44&$F$44&$G$44,$AD$41:$AF$48,3,FALSE)),\"Wetlab #1 (AFT)\",(VLOOKUP($E$44&$F$44&$G$44,$AD$41:$AF$48,3,FALSE)&\" (Forward)\"))","v":"Wetlab #1 (AFT)"},{"$f":"Cal!$B$151","v":"946"},{"$f":"Cal!$B$150","v":"BBFL2"},{"$f":"Cal!$B$153","v":"Chlorophyll"},{"$f":"Cal!$B$160","v":"CDOM"},{"$f":"Cal!$B$167","v":"650"},null,null,null,null,null,null,null,null,null,null,null,null,null,null,null,null,null,null,null,"CHL A",700,470,{"$f":"$AA$44&$AB$44&$AC$44","v":"CHL A700470"},4249861,"KIT, SENSOR, FLUOROMETER-WET LABS BB2FL-VMT (470/700/CHL-A)"]
[{"$f":"IF(ISNA(VLOOKUP($E$45&$F$45&$G$45,$AD$41:$AF$48,2,FALSE)),\"\",(VLOOKUP($E$45&$F$45&$G$45,$AD$41:$AF$48,2,FALSE)))","v":""},{"$f":"IF(ISNA(VLOOKUP($E$45&$F$45&$G$45,$AD$41:$AF$48,3,FALSE)),\"Wetlab #2 (AFT)\",(VLOOKUP($E$45&$F$45&$G$45,$AD$41:$AF$48,3,FALSE)&\" (AFT)\"))","v":"Wetlab #2 (AFT)"},{"$f":"Cal!$B$177","v":"1390"},{"$f":"Cal!$B$176","v":"BB2FL"},{"$f":"Cal!$B$179","v":"Chlorophyll"},{"$f":"Cal!$B$186","v":"470"},{"$f":"Cal!$B$193","v":"700"},null,null,null,null,null,null,null,null,null,null,null,null,null,null,null,null,null,null,null,"None","None",532,{"$f":"$AA$45&$AB$45&$AC$45","v":"NoneNone532"},4277480,"PUCK, SINGLE BACKSCATTER 532, WET LABS"]
[4272424,"SENSOR, CTD - SBE, TITANIUM",{"$f":"'Weight sheet'!$H$146","v":0},null,null,null,null,null,null,null,null,null,null,null,null,null,null,null,null,null,null,null,null,null,null,null,"None","None","None",{"$f":"$AA$46&$AB$46&$AC$46","v":"NoneNoneNone"},"None","Wetlab not installed"]
[4272326,"PUMP, MINI, SUBMERSIBLE - 10,500M, TITANIUM (CTD Pump)",{"$f":"'Weight sheet'!$H$148","v":0}]
[4272347,"SENSOR, OXYGEN, FREQUENCY OUTPUT - SBE 43F-1, TITANIUM HSG (Pumped)",{"$f":"'Weight sheet'!$H$151","v":0}]
[null,"Argos Tag",{"$f":"'Weight sheet'!$H$157","v":"90993"}]
[null,"Assy., PAR, BSI - QSP2000",{"$f":"'Weight sheet'!$H$165","v":0}]
[4314372,"Assy., Radiation Detector",{"$f":"'Weight sheet'!$H$170","v":0}]
[4314562,"Assy, Nortek ADCP",{"$f":"'Weight sheet'!$H$179","v":0}]
[4321091,"Assy, Imagenex ECHOSounder",{"$f":"'Weight sheet'!$H$186","v":0}]
[null,"Assy., RAFOS",{"$f":"'Weight sheet'!$H$194","v":0}]
[null,"Assy., New Sensor #1",{"$f":"'Weight sheet'!$H$202","v":0}]
[null,"Assy., New Sensor #2",{"$f":"'Weight sheet'!$H$210","v":0}]
[]
[]
[]
[]
[]
[null,"Accessory & Spares Parts:"]
["Item","Description","Serial Number","Comments"]
[4193188,"KIT, PRE-FLIGHT DIAGNOSTIC LAPTOP - SEAGLIDER",null,"Provided on an as ordered item"]
[4195828,"Kit, Spares, Seaglider",null,"Not Serialized, unless it has an antenna"]
[4196238,"Kit,Basestation,Seaglider",null,"Provided on an as ordered item"]
[4199261,"Computer,Laptop",null,"Provided on an as ordered item"]
[4249520,"KIT, STANDARD ANTENNA MAST ASSY, SEAGLIDER",null,"Provided on an as ordered item"]
[4249882,"KIT,CT SAIL W / BOARDS,SEAGLIDER",null,"Provided on an as ordered item"]

{"sheet":"Log","index":14,"n_rows":38,"n_cols":3,"rows_kept":38,"cut":false,"hidden":false,"merged":[]}
["Date","REV","Change"]
["2011-06-03","-","Preliminary Release "]
["2011-06-04",1,"Fixed Wetlab section (CHL A names links) in sg_calib_constants"]
["2011-06-05",2,"Fixed errors in sg_calib_constants A91 & A112"]
["2011-06-13",3,"Fixed error when Ballast is to small and zero'd out leaving tape and Straps installed that should have been removed. "]
["2011-06-14",4,"Added default weights for Argos tag"]
["2011-06-19",5,"Added code to update Mass, Density, & VBD on the Ballast tab to calculate Vol Max after tank regression."]
["2011-06-23",6,"Fixed Spelling error"]
["2011-06-24",7,"Added Subassembly Serial number logging on the Weight sheet"]
["2011-06-27",8,"Added recording of Ocean measured Thrust on Ballast Tab"]
["2011-06-28",9,"Added \"Ballasting Instructions\" tab"]
["2011-07-06",10,"Added PAR: part numbers, description, LCG, volume, and VCG&B.\nConverted PAR_2 to Radiation Sensor. Updated all numbers to Green or Red."]
["2011-07-07",11,"Fixed summed weight calculation on \"Weight sheet\" for Fairings. Added code to make sure all Pads, Straps, and Tape are zeroed out before starting Ballast solution. Corrected rh0 to be displayed as kg/m3 for Matlab script and added unit of measure for rh0, Mass, and Vol Max."]
["2011-07-08",12,"Fixed rh0 & Mass values on CMDFILE tab that got changed due to change on sg_calib_constants. Fixed a bug in the Macro if Lead weight is small."]
["2011-07-11",13,"Adjusted Max foam before spreading it to 3 or 4 quadrants."]
["2011-07-12",14,"Fixed formulas for none numeric serial numbers for all sensors in the sg_calib_constants tab"]
["2011-07-13",15,"Added Macro button on Trim tab Cell AA2 for Pre-Flight data error checking."]
["2011-07-14",16,"change Mass back to kg on sg_calib_constants Tab"]
["2011-07-22",17,"Changed Sensor #1 & #2 names to match Sensor #"]
["2011-07-26",18,"Added check for Density mismatch between \"Trim\" tab and \"Ballast\" Tab before finalizing Trimsheet for customer.\nAdded check to update New Environment comments on Ballast Tab"]
["2011-07-27",19,"Added saving all ballast information after tank regression on the \"Cal\" Tab."]
["2011-07-28",20,"- Added \"Nose weight to detachable nose screws\" to both \"Weight sheet\" & \"Trim\" Tab. Updated Macro for new Ogive Plate and screw cells due to the line being added.\n- Corrected Volume calculation for detachable nose for the correct material.\n- Corrected Volume calculation for Ogive Top and Bottom Hatch covers.\n- Fixed \"Weight sheet\" Tab \"Error check\" button for line shift in the Forward Ogive section. "]
["2011-08-01",21,"Fixed Volume and LCG for Ogive fairings.\nSet Density on Ballast Tab B29 equal to Rho after running Ocean Calc macro\nFixed Customer Calc when less Lead is needed."]
["2011-08-03",22,"-Added 2 more sensors.\n-Fixed Nose plate weights for Ogive Fairing to sum up on \"Ballast\" Tab."]
["2011-08-09",23,"Fixed macro when setting default Ogive nose plate & screws. It was off by one line and not setting small screw."]
["2011-08-10",24,"-Added section for Foam Blocks on Weight Sheet & Trim Sheet\n-Added RAFOS Sensor"]
["2011-08-17",25,"Added LCG and VCG&B info for Foam Blocks"]
["2011-08-19",26,"- Fixed Weight sheet Ballast sub total formula to correct Absolute value for negative numbers.\n- Added Graphic for ballast  placement on the Lead Worksheet."]
["2011-09-08",27,"- Fixed spelling errors and made all serial number labels to be \"Serial #\"\n-fixed Macro that removed pad and left straps"]
["2011-09-14",28,"Fix Botton text and Button size to lock"]
["2011-09-20",29,"Fixed Oil Volume calculation on Weight Sheet from Fixed number to value on Material Tab."]
["2011-09-22",30,"- Fixed Argos Scale weight link on the Trim Tab.\n- Updated Radiation parts names and paramenters"]
["2011-10-03",31,"- Updated Comments on Ballast Tab  in New Environment Ballasting section.\n- Added check for Material tab Comment in the Preflight error check Macro."]
["2011-10-07",32,"Updated Lead Placement wheel to correct Bottom and Port Numbering"]
["2011-10-11",33,"Updated \"CHL A\" to \"Chlorophyll\" on the Cal Sheet Wetlab pull down menu."]
["2011-10-17",34,"- Cleaned up Customer Ballast code\n- Enhanced VCB Separation code\n- update small lead solution\n- Linked Lead tape from Trim sheet to Weight Sheet  & Lead worksheet\n- Updated the Ballasting Instructions"]
["2011-11-30",35,"Added Serial Number for Modem Cable Only applies to XG or XM"]
["2011-12-09",36,"Added pull down for Modem Type and model Number"]